1,2,4,5-Tetraphosphaspiro[2.2]pentane, 1,2,4,5-tetrakis(1,1-dimethylethyl)-

Gas phase ion energetics data

Data compiled by: Sharon G. Lias, John E. Bartmess, Joel F. Liebman, John L. Holmes, Rhoda D. Levin, and W. Gary Mallard

Ionization energy determinations

IE (eV) Method Reference Comment
7.5PEGleiter, Uschmann, et al., 1986
7.8PEGleiter, Uschmann, et al., 1986Vertical value

References

Gleiter, Uschmann, et al., 1986
Gleiter, R.; Uschmann, J.; Baudler, M., The electronic structure of substituted 1,2,4,5-tetraphosphaspiro[2.2]pentanes and 1,2,4,5-tetraphospha-3-silaspiro[2.2]pentanes, J. Chem. Soc. Dalton Trans., 1986, 1659. [all data]