SOF3-

Vibrational and/or electronic energy levels

Data compiled by: Marilyn E. Jacox

State:   X

Vib.
sym.
 No.   Approximate
 type of mode
 cm-1   Med.   Method   References

SO stretch 1264 m Cs Ar IR Garber and Ault, 1983
SF stretch 695 Cs Ar IR Garber and Ault, 1983
SF stretch 667 Cs Ar IR Garber and Ault, 1983
SF stretch 623 Cs Ar IR Garber and Ault, 1983

Additional references: Jacox, 1994, page 304

References

Garber and Ault, 1983
Garber, K.; Ault, B.S., Infrared matrix isolation study of the sulfur oxyfluoride (SO2F-, SOF3-, and SO2F3-) anions ion paired with cesium(1+), Inorg. Chem., 1983, 22, 18, 2509, https://doi.org/10.1021/ic00160a009 . [all data]

Jacox, 1994
Jacox, M.E., Vibrational and electronic energy levels of polyatomic transient molecules, American Chemical Society, Washington, DC, 1994, 464. [all data]