Phensuximide

Kovats' RI, non-polar column, temperature ramp

View large format table.

Column type Active phase I Reference Comment
CapillarySE-301618.Schepers, Wijsbeek, et al., 198225. m/0.49 mm/1.14 μm, 100. C @ 2. min, 8. K/min, 275. C @ 15. min

Van Den Dool and Kratz RI, non-polar column, temperature ramp

View large format table.

Column type Active phase I Reference Comment
CapillaryDB-11607.Perrigo, Peel, et al., 198515. m/0.32 mm/0.25 μm, He, 8. K/min, 280. C @ 5. min; Tstart: 120. C
CapillaryDB-11607.Perrigo, Ballantyne, et al., 198415. m/0.25 mm/0.25 μm, He, 8. K/min, 280. C @ 5. min; Tstart: 120. C
CapillaryDB-11611.Perrigo, Ballantyne, et al., 198415. m/0.25 mm/0.25 μm, He, 12. K/min, 280. C @ 5. min; Tstart: 120. C
CapillaryDB-11613.Perrigo, Ballantyne, et al., 198415. m/0.25 mm/0.25 μm, He, 15. K/min, 280. C @ 5. min; Tstart: 120. C
CapillaryDB-11603.Perrigo, Ballantyne, et al., 198415. m/0.25 mm/0.25 μm, He, 5. K/min, 280. C @ 5. min; Tstart: 120. C
PackedSE-301620.Perrigo and Peel, 1981N2, Chromosorb W, 130. C @ 2. min, 8. K/min, 290. C @ 8. min; Column length: 1.8 m

Normal alkane RI, non-polar column, temperature ramp

View large format table.

Column type Active phase I Reference Comment
CapillaryDB-11601.Anderson and Fuller, 198710. m/0.53 mm/2.65 μm, He, 5. K/min; Tstart: 130. C; Tend: 230. C
CapillaryDB-11607.Sharp, 198715. m/0.25 mm/0.25 μm, He, 130. C @ 1. min, 10. K/min, 290. C @ 10. min
PackedSE-301620.Peel and Perrigo, 1976Nitrogen, Chromosorb W AW DMS (80-100 mesh), 130. C @ 2. min, 8. K/min, 290. C @ 8. min; Column length: 2. m
PackedSE-301620.Peel and Perrigo, 1975N2, Chromosorb W AW DMS, 130. C @ 2. min, 8. K/min, 290. C @ 8. min; Column length: 2. m

Normal alkane RI, non-polar column, custom temperature program

View large format table.

Column type Active phase I Reference Comment
OtherMethyl Silicone1634.Ardrey and Moffat, 1981Program: not specified

Lee's RI, non-polar column, custom temperature program

View large format table.

Column type Active phase I Reference Comment
CapillaryMethyl Silicone284.01Eckel, Ross, et al., 1993Program: not specified

References

Schepers, Wijsbeek, et al., 1982
Schepers, P.; Wijsbeek, J.; Franke, J.P.; de Zeeuw, R.A., Applicability of capillary gas chromatography to substance identification in toxicology by means of retention indices, J. Forensic Sci., 1982, 27, 1, 49-60. [all data]

Perrigo, Peel, et al., 1985
Perrigo, B.J.; Peel, H.W.; Ballantyne, D.J., Use of Dual-Column Fused-Silica Capillary Gas Chromatography in Combination with Detector Response Factors for Analytical Toxicology., J. Chromatogr., 1985, 341, 81-88, https://doi.org/10.1016/S0378-4347(00)84011-6 . [all data]

Perrigo, Ballantyne, et al., 1984
Perrigo, B.J.; Ballantyne, D.J.; Peel, H.W., Condierations in developing a data base for drugs on a DBI capillary column, J. Can. Soc. Forensic Sci., 1984, 17, 2, 41-49, https://doi.org/10.1080/00085030.1984.10757360 . [all data]

Perrigo and Peel, 1981
Perrigo, B.J.; Peel, H.W., The use of retention indices and temperature-programmed gas chromatography in analytical toxicology, J. Chromatogr. Sci., 1981, 19, 5, 219-226, https://doi.org/10.1093/chromsci/19.5.219 . [all data]

Anderson and Fuller, 1987
Anderson, W.H.; Fuller, D.C., A simplified procedure for the isolation, characterization, and identification of weak acid and neutral drugs from whole blood, J. Anal. Toxicol., 1987, 11, 5, 198-204, https://doi.org/10.1093/jat/11.5.198 . [all data]

Sharp, 1987
Sharp, M.E., A rapid screening procedure for acidic and neutral drugs in blood by high resolution gas chromatography, J. Anal. Toxicol., 1987, 11, 1, 8-11, https://doi.org/10.1093/jat/11.1.8 . [all data]

Peel and Perrigo, 1976
Peel, H.W.; Perrigo, B., A practical gas chromatographic screening procedure for toxicological analysis, Can. Soc. Forens. Sci. J., 1976, 9, 2, 69-74, https://doi.org/10.1080/00085030.1976.10757247 . [all data]

Peel and Perrigo, 1975
Peel, H.W.; Perrigo, B., A practical gas chromatographic screening procedure for toxicological analysis, Can.Soc.Forens.Sci.J., 1975, 9, 2, 69-74, https://doi.org/10.1080/00085030.1976.10757247 . [all data]

Ardrey and Moffat, 1981
Ardrey, R.E.; Moffat, A.C., Gas-liquid chromatographic retention indices of 1318 substances of toxicological interest on SE-30 or OV-1 stationary phase, J. Chromatogr., 1981, 220, 3, 195-252, https://doi.org/10.1016/S0021-9673(00)81925-1 . [all data]

Eckel, Ross, et al., 1993
Eckel, W.P.; Ross, B.; Isensee, R.K., Pentobarbital found in ground water, Ground Water, 1993, 31, 5, 801-804, https://doi.org/10.1111/j.1745-6584.1993.tb00853.x . [all data]