2-[(Diethylamino)thioxomethyl]-N,N-dimethylbenzamide

Phase change data

Data compiled by: William E. Acree, Jr., James S. Chickos

Enthalpy of fusion

ΔfusH (kJ/mol) Temperature (K) Method Reference
28.79353.5DSCAltamura, Coppini, et al., 2005

References

Altamura, Coppini, et al., 2005
Altamura, Maria; Coppini, Giacomo; Cuda, Francesco; Dapporto, Paolo; Guerri, Annalisa; Guidi, Antonio; Nativi, Cristina; Paoli, Paola; Rossi, Patrizia, A structural investigation on the flexibility of certain o-phthalic acid derivatives, Journal of Molecular Structure, 2005, 749, 1-3, 20-30, https://doi.org/10.1016/j.molstruc.2005.03.023 . [all data]