CAS Reg. No. 86046-90-4

Reaction thermochemistry data

Data compiled by: John E. Bartmess

Individual Reactions

(CAS Reg. No. 86046-90-4 • 4294967295Allene) + Allene = CAS Reg. No. 86046-90-4

By formula: (CAS Reg. No. 86046-90-4 • 4294967295C3H4) + C3H4 = CAS Reg. No. 86046-90-4

Quantity Value Units Method Reference Comment
Δr14.8 ± 3.7kcal/molTherBartmess and Burnham, 1984gas phase; value altered from reference due to change in acidity scale

References

Bartmess and Burnham, 1984
Bartmess, J.E.; Burnham, R., Effect of central substituents on the gas phase acidities of propenes, J. Org. Chem., 1984, 49, 1382. [all data]