tBuCH=C radical

Gas phase ion energetics data

Data compiled by: John E. Bartmess

Electron affinity determinations

EA (eV) Method Reference Comment
0.645 ± 0.015LPESGunion and Lineberger, 1996

References

Gunion and Lineberger, 1996
Gunion, R.F.; Lineberger, W.C., Ultraviolet Photoelectron Spectroscopy of the tert-Butylvinylidene Anion, J. Phys. Chem., 1996, 100, 11, 4395, https://doi.org/10.1021/jp953113r . [all data]