Alloaromadendrene oxide

Normal alkane RI, non-polar column, temperature ramp

Data compiled by: NIST Mass Spectrometry Data Center, William E. Wallace, director

Column type CapillaryCapillaryCapillaryCapillaryCapillary
Active phase RTX-1HP-5 MSDB-5DB-5DB-5
Column length (m) 60.30.30.30.30.
Carrier gas HeHeliumHeHeliumHe
Substrate
Column diameter (mm) 0.220.250.250.250.25
Phase thickness (μm) 0.250.250.250.250.25
Tstart (C) 60.50.60.60.60.
Tend (C) 230.240.300.220.220.
Heat rate (K/min) 2.3.3.4.4.
Initial hold (min)     5.
Final hold (min) 35.
I 1622.1681.1639.1642.1644.
ReferencePaolini, Tomi, et al., 2008Sarikurkcu, Tepe, et al., 2008Limberger, Scopel, et al., 2007Morteza-Semnani, Saeedi, et al., 2007Morteza-Semnani K., Akbarzadeh M., et al., 2006
Comment MSDC-RI MSDC-RI MSDC-RI MSDC-RI MSDC-RI
Column type CapillaryCapillary
Active phase DB-5DB-5
Column length (m) 30.30.
Carrier gas HeHe
Substrate
Column diameter (mm) 0.250.25
Phase thickness (μm) 0.250.25
Tstart (C) 60.60.
Tend (C) 260.220.
Heat rate (K/min) 5.4.
Initial hold (min)  4.
Final hold (min)
I 1650.1641.
ReferenceSabulal, Dan, et al., 2006Morteza-Semnani and Saeedi, 2005
Comment MSDC-RI MSDC-RI

References

Paolini, Tomi, et al., 2008
Paolini, J.; Tomi, P.; Bernardini, A.-F.; Bradesi, P.; Casanova, J.; Kaloustian, J., Detailed analysis of the essential oil from Cistus albidus L. by combination of GC/RI, GC/MS and 13C-NMR spectroscopy, N.Z. J. Agric. Res., 2008, 22, 14, 1270-1278. [all data]

Sarikurkcu, Tepe, et al., 2008
Sarikurkcu, C.; Tepe, B.; Daferera, D.; Polissiou, M.; Harmandar, M., Studies on the anioxidant activity of the essential oil and methanol extract of Marrubium globosum subsp. globosum (lamiaceae) by three different chemical assays, Bioresource Technol., 2008, 99, 10, 4239-4246, https://doi.org/10.1016/j.biortech.2007.08.058 . [all data]

Limberger, Scopel, et al., 2007
Limberger, R.P.; Scopel, M.; Sobral, M.; Henriques, A.T., Comparative analysis of volatiles from Drimys brasiliensis Miers and D. angustifolia Miers (Winteraceae) from Southern Brazil, Biochem. Syst. Ecol., 2007, 35, 3, 130-137, https://doi.org/10.1016/j.bse.2006.09.007 . [all data]

Morteza-Semnani, Saeedi, et al., 2007
Morteza-Semnani, K.; Saeedi, M.; Akbarzadeh, M., Essential oil composition of Teucrium scordium L., Acta Pharm., 2007, 57, 4, 499-504, https://doi.org/10.2478/v10007-007-0040-6 . [all data]

Morteza-Semnani K., Akbarzadeh M., et al., 2006
Morteza-Semnani K.; Akbarzadeh M.; Moshiri K., The essential oil composition of Eupatorium cannabinum L. from Iran, Flavour Fragr. J., 2006, 21, 3, 521-523, https://doi.org/10.1002/ffj.1687 . [all data]

Sabulal, Dan, et al., 2006
Sabulal, B.; Dan, M.; Anil, J.J.; Kurup, R.; Pradeep, N.S.; Valsamma, R.K.; George, V., Caryophyllene-rich rhizome oil of Zingiber nimmonii from South India: Chemical characterization and antimicrobial activity, Phytochemistry, 2006, 67, 22, 2469-2473, https://doi.org/10.1016/j.phytochem.2006.08.003 . [all data]

Morteza-Semnani and Saeedi, 2005
Morteza-Semnani, K.; Saeedi, M., The essential oil composition of Hypericum androsaemum L. leaves and flowers from Iran, Flavour Fragr. J., 2005, 20, 3, 332-334, https://doi.org/10.1002/ffj.1432 . [all data]