Methyl(1,1,2-trimethylpropyl)malononitrile

Condensed phase thermochemistry data

Data compiled by: Hussein Y. Afeefy, Joel F. Liebman, and Stephen E. Stein

Quantity Value Units Method Reference Comment
Δfsolid17.3 ± 0.63kJ/molCcbBeckhaus, Dogan, et al., 1990
Quantity Value Units Method Reference Comment
Δcsolid-6239.01 ± 0.63kJ/molCcbBeckhaus, Dogan, et al., 1990

References

Beckhaus, Dogan, et al., 1990
Beckhaus, H.D.; Dogan, B.; Pakusch, J.; Verevkin, S.; Ruechardt, C., Geminal substituent effects. 4. The dependence of the inverse anomeric effect of geminal cyano groups on the structure, Chem. Ber., 1990, 123, 2153-2159. [all data]