Benzyl butyl phthalate

Lee's RI, non-polar column, temperature ramp

Data compiled by: NIST Mass Spectrometry Data Center, William E. Wallace, director

Column type Capillary
Active phase DB-5
Column length (m) 30.
Carrier gas He
Substrate
Column diameter (mm) 0.32
Phase thickness (μm) 0.25
Tstart (C) 40.
Tend (C) 285.
Heat rate (K/min) 8.
Initial hold (min) 3.
Final hold (min) 29.5
I 378.4
ReferenceDonnelly, Abdel-Hamid, et al., 1993
Comment MSDC-RI

Phase change data

Data compiled by: William E. Acree, Jr., James S. Chickos

Enthalpy of vaporization

ΔvapH (kJ/mol) Temperature (K) Method Reference Comment
89.0431.AStephenson and Malanowski, 1987Based on data from 416. - 516. K.

Normal alkane RI, non-polar column, custom temperature program

Data compiled by: NIST Mass Spectrometry Data Center, William E. Wallace, director

Column type CapillaryCapillaryCapillaryOtherOther
Active phase OV-1OV-1, SE-30, Methyl silicone, SP-2100, OV-101, DB-1, etc.OV-1, SE-30, Methyl silicone, SP-2100, OV-101, DB-1, etc.Methyl SiliconeMethyl Silicone
Column length (m) 50.50.50.
Carrier gas HydrogenHydrogenHydrogen
Substrate
Column diameter (mm) 0.320.320.32
Phase thickness (μm)
Program not specifiednot specifiednot specifiednot specifiednot specified
I 2287.2287.2290.2290.2327.
ReferenceWaggott and Davies, 1984Waggott and Davies, 1984Waggott and Davies, 1984Ardrey and Moffat, 1981Ardrey and Moffat, 1981
Comment MSDC-RI MSDC-RI MSDC-RI MSDC-RI MSDC-RI

References

Donnelly, Abdel-Hamid, et al., 1993
Donnelly, J.R.; Abdel-Hamid, M.S.; Jeter, J.L.; Gurka, D.F., Application of gas chromatographic retention properties to the identification of environmental contaminants, J. Chromatogr., 1993, 642, 1-2, 409-415, https://doi.org/10.1016/0021-9673(93)80106-I . [all data]