2,4,5,7-Tetramethyl-4,5-bis(4-tert-butylphenyl)octane

Phase change data

Data compiled as indicated in comments:
ALS - Hussein Y. Afeefy, Joel F. Liebman, and Stephen E. Stein
DRB - Donald R. Burgess, Jr.

Quantity Value Units Method Reference Comment
Δsub183.kJ/molEKratt, Beckhaus, et al., 1983ΔHfussion = 9.0±0.1 kcal/mol at 120°C, see Beckhaus, 1983; ALS
Δsub182.6kJ/molN/AKratt, Beckhaus, et al., 1983DRB

References

Kratt, Beckhaus, et al., 1983
Kratt, G.; Beckhaus, H.D.; Bernlohr, W.; Ruchardt, C., Thermolabile kohlenwasserstoffe. XVII. Verbrennungsenthalpie und bildungsenthalpie von zehn sym.-tetraalkyl-1,2-diarylethanen, Thermochim. Acta, 1983, 62, 279-194. [all data]

Beckhaus, 1983
Beckhaus, H.D., Application of force field calculations. IV. Force field for the calculation of the structures and heats of formation of alkylbenzenes and its test of reliability on highly strained diphenylethanes, Chem. Ber., 1983, 116, 86-96. [all data]