β-Cyclodextrin undecahydrate

Condensed phase thermochemistry data

Data compiled by: Eugene S. Domalski and Elizabeth D. Hearing

Constant pressure heat capacity of solid

Cp,solid (cal/mol*K) Temperature (K) Reference Comment
500.2299.53Hanabata, Matsuo, et al., 1987T = 13 to 300 K. Unsmoothed experimental datum.

Phase change data

Data compiled by: Eugene S. Domalski and Elizabeth D. Hearing

Temperature of phase transition

Ttrs (K) Initial Phase Final Phase Reference Comment
226.crystaline, IIcrystaline, IHanabata, Matsuo, et al., 1987S = 45.0 J/mol*K

References

Hanabata, Matsuo, et al., 1987
Hanabata, H.; Matsuo, T.; Suga, H., Calorimetric study of b-cyclodextrin undecahydrate, J. Inclusion Phenom., 1987, 5(3), 325-333. [all data]