1,3-Isobenzofurandione, hexahydro-

Phase change data

Data compiled by: William E. Acree, Jr., James S. Chickos

Enthalpy of fusion

ΔfusH (kJ/mol) Temperature (K) Method Reference Comment
14.71303.8ACLv, Gao, et al., 2008Based on data from 80. - 390. K.

References

Lv, Gao, et al., 2008
Lv, X.-C.; Gao, X.-H.; Tan, Z.-C.; Li, Y.-S.; Sun, L.-X., Molar heat capacity and thermodynamic properties of 1,2-cyclohexane dicarboxylic anhydride [C8H10O3], J Therm Anal Calorim, 2008, 92, 2, 523-527, https://doi.org/10.1007/s10973-007-8445-5 . [all data]