2-Acetyl-1-pyrroline

Normal alkane RI, non-polar column, custom temperature program

Data compiled by: NIST Mass Spectrometry Data Center, William E. Wallace, director

Column type CapillaryCapillaryCapillaryCapillaryCapillary
Active phase SE-54SE-54HP-5SE-54DB-5
Column length (m) 30. 50.30.30.
Carrier gas HeliumHelium  H2
Substrate
Column diameter (mm) 0.32 0.320.320.3
Phase thickness (μm) 0.25 1.050.250.25
Program 35 0C (2 min) 10 0C/min -> 50 0C (2 min) 6 0C/min -> 250 0Cnot specified35 0C (10 min) 10 0C/min -> 150 0C 20 0C/min -> 250 0C (10 min)35C(2min) => 40C/min => 60C(2min) => 6C/min => 180C => 10C/min => 230C(10min)35C (1min) => 40C/min => 60C (5min) => 4C/min => 240C
I 922.927.922.922.912.
ReferenceChristlbauer and Schieberle, 2009Frauendorfer and Schieberle, 2008Carrapiso and Garsia, 2007Lasekan, Buettner, et al., 2007Triqui and Bouchriti, 2003
Comment MSDC-RI MSDC-RI MSDC-RI MSDC-RI MSDC-RI
Column type CapillaryCapillaryCapillaryCapillaryCapillary
Active phase DB-5RTX-5RTX-5DB-5SE-54
Column length (m) 30.  30.25.
Carrier gas Helium  HeHe
Substrate
Column diameter (mm) 0.25  0.320.32
Phase thickness (μm) 0.25  0.250.25
Program 35 0C (2 min) 40 0C/min -> 50 0C (1 min) 6 0C/min -> 180 0C 10 0C/min -> 240 0C (10 min)not specifiednot specified35C(1min) => 40C/min => 60C (1min) => 6C/min => 230C35C(2min) => 50C/min => 60C(2min) => 4C/min => 230C
I 925.923.922.915.923.
ReferenceLin, Fay, et al., 2000Masanetz, Guth, et al., 1998Masanetz, Guth, et al., 1998Matsui, Guth, et al., 1998Zehentbauer and Grosch, 1998
Comment MSDC-RI MSDC-RI MSDC-RI MSDC-RI MSDC-RI
Column type CapillaryCapillaryCapillaryCapillary
Active phase DB-5SE-54SE-54SE-54
Column length (m) 30. 30.30.
Carrier gas   HeHe
Substrate
Column diameter (mm) 0.32 0.320.32
Phase thickness (μm)    0.3
Program not specifiednot specified40 0C -> (unknowm rate) 50 0C (2 min) 6 0C/min -> 200 0C35C(2min) => 40C/min => 50C(2min) => 6C/min => 230C(10min)
I 921.924.925.923.
ReferenceSchieberle, 1996Guth and Grosch, 1993Milo and Grosch, 1993Blank, Fischer, et al., 1989
Comment MSDC-RI MSDC-RI MSDC-RI MSDC-RI

Normal alkane RI, non-polar column, temperature ramp

Data compiled by: NIST Mass Spectrometry Data Center, William E. Wallace, director

Column type CapillaryCapillaryCapillaryCapillaryCapillary
Active phase SE-54RTX-5 MSVF-5MSDB-5OV-101
Column length (m) 30.30.30.30.10.
Carrier gas  Helium He
Substrate
Column diameter (mm) 0.320.250.250.250.25
Phase thickness (μm) 0.250.500.250.25
Tstart (C) 0.35.40.40.35.
Tend (C) 200.225.250.250.225.
Heat rate (K/min) 6.6.7.4.6.
Initial hold (min) 2.5. 2.5.
Final hold (min)  10. 10.
I 922.921.918.920.896.
ReferenceLaselan, Buettner, et al., 2009Watcharananun, Cadwallader, et al., 2009Ghiasvand, Setkova, et al., 2007Shen X., Gao Y., et al., 2006Bloss, Acree, et al., 2002
Comment MSDC-RI MSDC-RI MSDC-RI MSDC-RI MSDC-RI
Column type CapillaryCapillaryCapillaryCapillaryCapillary
Active phase DB-5MSDB-5DB-1SE-54SE-54
Column length (m) 60. 60.30.30.
Carrier gas He
Substrate
Column diameter (mm) 0.25 0.250.520.52
Phase thickness (μm) 0.250.25 1.51.5
Tstart (C) 40.34.30.5.5.
Tend (C) 200.200.200.230.230.
Heat rate (K/min) 2.5.4.6.6.
Initial hold (min) 5.3.25.
Final hold (min) 30.10.20.
I 927.918.892.925.925.
ReferenceLee, Suriyaphan, et al., 2001Schlüter, Steinhart, et al., 1999Buttery, Ling, et al., 1997Milo and Grosch, 1996Milo and Grosch, 1996
Comment MSDC-RI MSDC-RI MSDC-RI MSDC-RI MSDC-RI
Column type CapillaryCapillaryCapillaryPacked
Active phase DB-1DB-1OV-101SE-54
Column length (m) 60.60.12.3.
Carrier gas HeHe
Substrate    Chromosorb G AW DMCS (100-120 mesh)
Column diameter (mm) 0.250.320.32
Phase thickness (μm)   0.52
Tstart (C) 30.30.35.50.
Tend (C) 200.200.225.230.
Heat rate (K/min) 4.4.4.6.
Initial hold (min) 25.25.3.2.
Final hold (min) 20.20. 10.
I 892.892.898.921.
ReferenceButtery and Ling, 1995Buttery, Stern, et al., 1994Roberts and Acree, 1994Schieberle, 1991
Comment MSDC-RI MSDC-RI MSDC-RI MSDC-RI

Normal alkane RI, polar column, custom temperature program

Data compiled by: NIST Mass Spectrometry Data Center, William E. Wallace, director

Column type CapillaryCapillaryCapillaryCapillaryCapillary
Active phase FFAPHP-FFAPDB-FFAPSupelcowax-10DB-FFAP
Column length (m)  30.30.60.30.
Carrier gas Helium   H2
Substrate
Column diameter (mm)  0.320.320.250.3
Phase thickness (μm)  0.250.250.250.25
Program not specified35 0C (10 min) 10 0C/min -> 150 0C 20 0C/min -> 250 0C (10 min)35C(2min) => 40C/min => 50C(2min) => 6C/min => 180C => 10C/min => 230C(10min)not specified35C (1min) => 40C/min => 60C (5min) => 4C/min => 220C
I 1314.1348.1323.1337.1322.
ReferenceFrauendorfer and Schieberle, 2008Carrapiso and Garsia, 2007Lasekan, Buettner, et al., 2007Baek and Cadwallader, 2003Triqui and Bouchriti, 2003
Comment MSDC-RI MSDC-RI MSDC-RI MSDC-RI MSDC-RI
Column type CapillaryCapillaryCapillaryCapillaryCapillary
Active phase FFAPFFAPFFAPFFAPFFAP
Column length (m) 30.30.30.25.
Carrier gas HeliumHeliumHeHe
Substrate
Column diameter (mm) 0.320.320.320.32
Phase thickness (μm) 0.250.250.250.25
Program 50 0C (2 min) 6 0C/min -> 180 0C 10 0C/min -> 180 0C (10 min)50 0C (2 min) 6 oC/min -> 180 0C 10 0C/min -> 240 0C (10 min)35C(1min) => 40C/min => 60C (1min) => 6C/min => 230C35C(2min) => 40C/min => 60C(2min) => 6C/min => 230Cnot specified
I 1328.1328.1309.1317.1319.
ReferenceBel Rhild, Fleury, et al., 2002Bel Rhild, Fleury, et al., 2002, 2Matsui, Guth, et al., 1998Zehentbauer and Grosch, 1998Guth and Grosch, 1993
Comment MSDC-RI MSDC-RI MSDC-RI MSDC-RI MSDC-RI
Column type Capillary
Active phase DB-Wax
Column length (m) 30.
Carrier gas He
Substrate
Column diameter (mm) 0.25
Phase thickness (μm) 0.5
Program 35C => 40C/min => 50C(2min) => 6C/min => 200C
I 1343.
ReferenceMilo and Grosch, 1993
Comment MSDC-RI

Van Den Dool and Kratz RI, polar column, temperature ramp

Data compiled by: NIST Mass Spectrometry Data Center, William E. Wallace, director

Column type CapillaryCapillaryCapillaryCapillaryCapillary
Active phase DB-FFAPDB-FFAPFFAPFFAPFFAP
Column length (m) 30.30.30.30.30.
Carrier gas HeHeHeHeHe
Substrate
Column diameter (mm) 0.250.250.250.250.25
Phase thickness (μm) 0.50.50.250.250.25
Tstart (C) 35.35.35.35.35.
Tend (C) 225.225.225.225.225.
Heat rate (K/min) 4.4.10.10.10.
Initial hold (min) 5.5.5.5.5.
Final hold (min) 30.30.25.25.25.
I 1340.1347.1331.1338.1335.
ReferenceJarunrattanasri, Theerakulkait, et al., 2007Jarunrattanasri, Theerakulkait, et al., 2007Lozano P.R., Drake M., et al., 2007Lozano P.R., Drake M., et al., 2007Lozano P.R., Miracle E.R., et al., 2007
Comment MSDC-RI MSDC-RI MSDC-RI MSDC-RI MSDC-RI
Column type CapillaryCapillaryCapillaryCapillaryCapillary
Active phase FFAPFFAPCP-Wax 52CBCP-Wax 52CBDB-Wax
Column length (m) 30.30.50.50.60.
Carrier gas He   H2
Substrate
Column diameter (mm) 0.320.320.320.320.25
Phase thickness (μm)  0.25  0.25
Tstart (C) 40.40.60.60.30.
Tend (C) 240.240.220.220.230.
Heat rate (K/min) 8.6.4.4.3.
Initial hold (min) 2.2.5.5.2.
Final hold (min) 5.10.30.30.4.
I 1328.1319.1335.1340.1327.
ReferenceSchlutt B., Moran N., et al., 2007Steinhaus and Schieberle, 2007Mahadevan and Farmer, 2006Mahadevan and Farmer, 2006Schwambach and Peterson, 2006
Comment MSDC-RI MSDC-RI MSDC-RI MSDC-RI MSDC-RI
Column type CapillaryCapillaryCapillaryCapillaryCapillary
Active phase DB-WaxDB-WaxDB-FFAPDB-WaxDB-FFAP
Column length (m) 60.30.30.30.15.
Carrier gas H2 N2 He
Substrate
Column diameter (mm) 0.250.250.250.250.32
Phase thickness (μm) 0.250.250.250.250.25
Tstart (C) 30.40.30.40.35.
Tend (C) 230.200.250.200.225.
Heat rate (K/min) 3.10.3.10.10.
Initial hold (min) 2.3.2.3.5.
Final hold (min) 4.20.2.20.15.
I 1327.1317.1336.1317.1336.
ReferenceSchwambach and Peterson, 2006Carunchia Whetstine, Croissant, et al., 2005Colahan-Sederstrom and Peterson, 2005Whetstine, Cadwallader, et al., 2005Avsar, Karagul-Yuceer, et al., 2004
Comment MSDC-RI MSDC-RI MSDC-RI MSDC-RI MSDC-RI
Column type CapillaryCapillaryCapillaryCapillaryCapillary
Active phase DB-WaxDB-WaxDB-WaxDB-FFAPDB-Wax
Column length (m) 30.30.60.30.30.
Carrier gas  HeHeHe
Substrate
Column diameter (mm) 0.250.250.250.250.25
Phase thickness (μm) 0.250.5 0.250.25
Tstart (C) 40.40.40.35.35.
Tend (C) 200.230.220.200.200.
Heat rate (K/min) 10.5.3.10.10.
Initial hold (min) 5.2.10.5.5.
Final hold (min) 15.10.30.30.30.
I 1323.1331.1330.1327.1311.
ReferenceAvsar, Karagul-Yuceer, et al., 2004Mahajan, Goddik, et al., 2004Hayata, Sakamoto, et al., 2003Karagül-Yüceer, Vlahovich, et al., 2003Karagül-Yüceer, Cadwallader, et al., 2002
Comment MSDC-RI MSDC-RI MSDC-RI MSDC-RI MSDC-RI
Column type CapillaryCapillaryCapillaryCapillaryCapillary
Active phase DB-WaxDB-WaxDB-WaxDB-WaxDB-Wax
Column length (m) 30.30.30.60.60.
Carrier gas HeHe HeHe
Substrate
Column diameter (mm) 0.320.530.250.250.25
Phase thickness (μm) 1.1.0.250.250.25
Tstart (C) 40.40.35.40.40.
Tend (C) 200.200.200.200.200.
Heat rate (K/min) 10.10.10.2.2.
Initial hold (min) 5.5.5.
Final hold (min) 30.30.30.
I 1334.1336.1331.1333.1333.
ReferenceWu and Cadwallader, 2002Wu and Cadwallader, 2002Karagül-Yüceer, Drake, et al., 2001Lee, Suriyaphan, et al., 2001Lee, Suriyaphan, et al., 2001
Comment MSDC-RI MSDC-RI MSDC-RI MSDC-RI MSDC-RI
Column type CapillaryCapillaryCapillary
Active phase DB-WaxDB-WaxSupelcowax-10
Column length (m) 30.30.60.
Carrier gas  HeHe
Substrate
Column diameter (mm) 0.320.320.25
Phase thickness (μm) 0.250.250.25
Tstart (C) 40.40.40.
Tend (C) 200.200.200.
Heat rate (K/min) 6.6.2.
Initial hold (min) 5.5.5.
Final hold (min) 30.30.30.
I 1326.1319.1329.
ReferenceCha and Cadwallader, 1998Cha, Kim, et al., 1998Cadwallader, Tan, et al., 1995
Comment MSDC-RI MSDC-RI MSDC-RI

References

Christlbauer and Schieberle, 2009
Christlbauer, M.; Schieberle, P., Characterization of the key aroma compounds in beef and pork vegetable gravies a la chef by application of the aroma extract dilution analysis, J. Agric. Food Chem., 2009, 57, 19, 9114-9112, https://doi.org/10.1021/jf9023189 . [all data]

Frauendorfer and Schieberle, 2008
Frauendorfer, F.; Schieberle, P., Changes in key aroma compounds of criollo cocoa beans during roasting, J. Agric. Food Chem., 2008, 56, 21, 10244-10251, https://doi.org/10.1021/jf802098f . [all data]

Carrapiso and Garsia, 2007
Carrapiso, A.I.; Garsia, C., Effect of sampling conditions on the odour-active compounds of iberian ham, Cienc. Technol. Aliment., 2007, 5, 4, 287-290, https://doi.org/10.1080/11358120709487703 . [all data]

Lasekan, Buettner, et al., 2007
Lasekan, O.; Buettner, A.; Christlbauer, M., Investigation of important odorants of palm wine (Elaeis guineensis), Food Chem., 2007, 105, 1, 15-23, https://doi.org/10.1016/j.foodchem.2006.12.052 . [all data]

Triqui and Bouchriti, 2003
Triqui, R.; Bouchriti, N., Freshness assessments of Moroccan sardine (Sardina pilchardus): comparison of overall sensory changes to instrumentally determined volatiles, J. Agric. Food Chem., 2003, 51, 26, 7540-7546, https://doi.org/10.1021/jf0348166 . [all data]

Lin, Fay, et al., 2000
Lin, J.; Fay, L.B.; Blank, I., Aroma impact compounds formed in meat-like model systems containing cysteine, ribose, and phospholipids in Frontiers of Flavour Science, Scheberle, P.; Engel, K.-H., ed(s)., Deutsche Forschungsanstalt fur Lebensmittelchemie, Garching, 2000, 498-502. [all data]

Masanetz, Guth, et al., 1998
Masanetz, C.; Guth, H.; Grosch, W., Fishy and hay-like off-flavours of dry spinach, Z. Lebensm. Unters. Forsch. A, 1998, 206, 2, 108-113, https://doi.org/10.1007/s002170050224 . [all data]

Matsui, Guth, et al., 1998
Matsui, T.; Guth, H.; Grosch, W., A comparative study of potent odorants in peanut, hazelnut, and pumpkin seed oils on the basis of aroma extract dilution analysis (AEDA) and gas chromatography-olfactometry of headspace samples (GCOH), Lipid - Fett, 1998, 100, 2, 51-56, https://doi.org/10.1002/(SICI)1521-4133(199802)100:2<51::AID-LIPI51>3.0.CO;2-W . [all data]

Zehentbauer and Grosch, 1998
Zehentbauer, G.; Grosch, W., Crust aroma of baguettes. I. Key odorants of baguettes prepared in two different ways, J. Cereal Science, 1998, 28, 1, 81-92, https://doi.org/10.1006/jcrs.1998.0184 . [all data]

Schieberle, 1996
Schieberle, P., Odour-active compounds in moderately roasted sesame, Food Chem., 1996, 55, 2, 145-152, https://doi.org/10.1016/0308-8146(95)00095-X . [all data]

Guth and Grosch, 1993
Guth, H.; Grosch, W., 12-Methyltridecanal, a species-specific odorant of stewed beef, Lebensm. Wiss. Technol., 1993, 26, 2, 171-177, https://doi.org/10.1006/fstl.1993.1035 . [all data]

Milo and Grosch, 1993
Milo, C.; Grosch, W., Changes in the odorants of boiled trout (Salmo fario) as affected by the storage of the raw material, J. Agric. Food Chem., 1993, 41, 11, 2076-2081, https://doi.org/10.1021/jf00035a048 . [all data]

Blank, Fischer, et al., 1989
Blank, I.; Fischer, K.-H.; Grosch, W., Intensive neutral odourants of linden honey, Z. Lebensm. Unters. Forsch., 1989, 189, 5, 426-433, https://doi.org/10.1007/BF01028316 . [all data]