2-Ethylphenyl acridine-9-carboxylate

Phase change data

Data compiled by: William E. Acree, Jr., James S. Chickos

Enthalpy of fusion

ΔfusH (kcal/mol) Temperature (K) Method Reference
7.27393.DSCKrzyminski, Malecha, et al., 2010

References

Krzyminski, Malecha, et al., 2010
Krzyminski, K.; Malecha, P.; Storoniak, P.; Zadykowicz, B.; Blazejowski, J., Thermochemistry and crystal lattice energetics of phenyl acridine-9-carboxylates and 9-phenoxycarbonyl-10-methylacridinium trifluoromethanesulphonates, J Therm Anal Calorim, 2010, 100, 1, 207-214, https://doi.org/10.1007/s10973-009-0154-9 . [all data]