2,3-diCN-benzoquinonide

Gas phase ion energetics data

Data compiled by: John E. Bartmess

Electron affinity determinations

EA (eV) Method Reference Comment
1.821 ± 0.091SIFarragher and Page, 1966The Magentron method, lacking mass analysis, is not considered reliable. G3MP2B3 calculations indicate an EA of ca. 3.65 eV

References

Farragher and Page, 1966
Farragher, A.L.; Page, F.M., Experimental Determination of Electron Affinities. Part 9. - Benzoquinone, Chloranil and Related Compounds, Trans. Farad. Soc., 1966, 62, 3072, https://doi.org/10.1039/tf9666203072 . [all data]