Hexanedioic acid, dicyclohexyl ester

Normal alkane RI, non-polar column, custom temperature program

Data compiled by: NIST Mass Spectrometry Data Center, William E. Wallace, director

Column type CapillaryOther
Active phase OV-1, SE-30, Methyl silicone, SP-2100, OV-101, DB-1, etc.Methyl Silicone
Column length (m) 50.
Carrier gas Hydrogen
Substrate
Column diameter (mm) 0.32
Phase thickness (μm)
Program not specifiednot specified
I 2282.2282.
ReferenceWaggott and Davies, 1984Ardrey and Moffat, 1981
Comment MSDC-RI MSDC-RI

Phase change data

Data compiled as indicated in comments:
TRC - Thermodynamics Research Center, NIST Boulder Laboratories, Chris Muzny director
AC - William E. Acree, Jr., James S. Chickos

Quantity Value Units Method Reference Comment
Tfus308.5KN/AWhite and Bishop, 1940Uncertainty assigned by TRC = 1. K; TRC
Quantity Value Units Method Reference Comment
Δvap25.41 ± 0.36kcal/molGSLipp, Krasnykh, et al., 2008Based on data from 338. - 369. K.; AC

In addition to the Thermodynamics Research Center (TRC) data available from this site, much more physical and chemical property data is available from the following TRC products:

Kovats' RI, non-polar column, custom temperature program

View large format table.

Column type Active phase I Reference Comment
PackedSE-302282.Ramsey, Lee, et al., 1980He, Chromosorb G HP (80-100 mesh); Column length: 1.5 m; Program: not specified

Normal alkane RI, non-polar column, isothermal

View large format table.

Column type Active phase Temperature (C) I Reference Comment
CapillaryOV-101200.2247.Lipp, Krasnykh, et al., 2008, 2Helium; Column length: 50. m; Column diameter: 0.25 mm
CapillaryOV-101210.2254.Lipp, Krasnykh, et al., 2008, 2Helium; Column length: 50. m; Column diameter: 0.25 mm
CapillaryOV-101220.2261.Lipp, Krasnykh, et al., 2008, 2Helium; Column length: 50. m; Column diameter: 0.25 mm
CapillaryOV-101230.2269.Lipp, Krasnykh, et al., 2008, 2Helium; Column length: 50. m; Column diameter: 0.25 mm

Normal alkane RI, non-polar column, temperature ramp

View large format table.

Column type Active phase I Reference Comment
CapillaryUltra-12234.Okumura, 199125. m/0.32 mm/0.25 μm, He, 3. K/min; Tstart: 80. C; Tend: 260. C

References

Waggott and Davies, 1984
Waggott, A.; Davies, I.W., Identification of organic pollutants using linear temperature programmed retention indices (LTPRIs) - Part II, 1984, retrieved from http://dwi.defra.gov.uk/research/completed-research/reports/dwi0383.pdf. [all data]

Ardrey and Moffat, 1981
Ardrey, R.E.; Moffat, A.C., Gas-liquid chromatographic retention indices of 1318 substances of toxicological interest on SE-30 or OV-1 stationary phase, J. Chromatogr., 1981, 220, 3, 195-252, https://doi.org/10.1016/S0021-9673(00)81925-1 . [all data]