4-Methyl-2-hydroxyquinoline

Gas phase thermochemistry data

Data compiled by: Hussein Y. Afeefy, Joel F. Liebman, and Stephen E. Stein

Quantity Value Units Method Reference Comment
Δfgas-14.6 ± 0.76kcal/molCcbRibeiro da Silva, Matos, et al., 1990

Condensed phase thermochemistry data

Data compiled by: Hussein Y. Afeefy, Joel F. Liebman, and Stephen E. Stein

Quantity Value Units Method Reference Comment
Δfsolid-45.20 ± 0.67kcal/molCcbRibeiro da Silva, Matos, et al., 1990
Quantity Value Units Method Reference Comment
Δcsolid-1202.7 ± 0.60kcal/molCcbRibeiro da Silva, Matos, et al., 1990

References

Ribeiro da Silva, Matos, et al., 1990
Ribeiro da Silva, M.A.V.; Matos, M.A.R.; Monte, M.J.S., Enthalpies of combustion, vapour pressures, and enthalpies of sublimation of 2-hydroxyquinoline, 4-methyl-2-hydroxyquinoline, 4-hydroxyquinoline, and 2-methyl-4-hydroxyquinoline, J. Chem. Thermodyn., 1990, 22, 609-616. [all data]