1,7-Diazabicyclo[5.4.3]tetradecane

Gas phase ion energetics data

Data compiled by: Sharon G. Lias, John E. Bartmess, Joel F. Liebman, John L. Holmes, Rhoda D. Levin, and W. Gary Mallard

Ionization energy determinations

IE (eV) Method Reference Comment
6.4PEHonegger, Yang, et al., 1985
6.75 ± 0.05PEHonegger, Yang, et al., 1985Vertical value

References

Honegger, Yang, et al., 1985
Honegger, E.; Yang, Z.-Z.; Heilbronner, E., Lone-Pair ionization energies of diazabicycloalkanes, J. Electron Spectrosc. Relat. Phenom., 1985, 36, 297. [all data]