Acrylophenone, 3,3-diphenyl-

Condensed phase thermochemistry data

Data compiled by: Hussein Y. Afeefy, Joel F. Liebman, and Stephen E. Stein

Quantity Value Units Method Reference Comment
Δfsolid19.45kcal/molCcbLandrieu and Blatt, 1924
Quantity Value Units Method Reference Comment
Δcsolid-2542.kcal/molCcbLandrieu and Blatt, 1924Corresponding Δfsolid = 20. kcal/mol (simple calculation by NIST; no Washburn corrections)

References

Landrieu and Blatt, 1924
Landrieu, P.; Blatt, H., Thermochemical study of diphenylphenylethinylcarbinol and its derivatives, Bull. Soc. Chim. Fr., 1924, 35, 1424-1236. [all data]