Cobalt, carbonyl-(η5-pentamethylcyclopentadienyl)(trimethylphosphine)

Gas phase ion energetics data

Data compiled by: Sharon G. Lias, John E. Bartmess, Joel F. Liebman, John L. Holmes, Rhoda D. Levin, and W. Gary Mallard

Ionization energy determinations

IE (eV) Method Reference Comment
5.5PEDudeney, Green, et al., 1983
5.99PEDudeney, Green, et al., 1983Vertical value

References

Dudeney, Green, et al., 1983
Dudeney, N.; Green, J.C.; Grebenik, P.; Kirchner, O.N., Synthesis and structural characterization of the electron rich complexes Co(η-C5Me5)(R2PCH2CH2PR2) (R = Me, Ph) photoelectron spectroscopic studies of some pentamethylcyclopentadienylphosphinecobalt complexes, J. Organomet. Chem., 1983, 252, 221. [all data]