1,2-Ethenediamine, N,N'-di-tert-butyl-N,N'-bis(trimethylsilyl)-(Z)-

Gas phase ion energetics data

Data compiled by: Sharon G. Lias, John E. Bartmess, Joel F. Liebman, John L. Holmes, Rhoda D. Levin, and W. Gary Mallard

Ionization energy determinations

IE (eV) Method Reference Comment
6.8PEtom Dieck, Bruder, et al., 1983
7.20PEtom Dieck, Bruder, et al., 1983Vertical value

References

tom Dieck, Bruder, et al., 1983
tom Dieck, H.; Bruder, B.; Franz, K.-D., Synthese offenkettiger und cyclischer, silylierter 1,2-ethendiamine, Chem. Ber., 1983, 116, 136. [all data]