1,2-Benzenedicarboxylic acid, dinonyl ester

Kovats' RI, non-polar column, isothermal

View large format table.

Column type Active phase Temperature (C) I Reference Comment
CapillarySE-30250.2876.Friocourt, Berthou, et al., 197942. m/0.3 mm/0.39 μm, He

Normal alkane RI, non-polar column, custom temperature program

View large format table.

Column type Active phase I Reference Comment
CapillaryOV-1, SE-30, Methyl silicone, SP-2100, OV-101, DB-1, etc.2876.Waggott and Davies, 1984Hydrogen; Column length: 50. m; Column diameter: 0.32 mm; Program: not specified

References

Friocourt, Berthou, et al., 1979
Friocourt, M.P.; Berthou, F.; Picart, D.; Dreano, Y.; Floch, H.H., Glass Capillary Column Gas Chromatography of Phthalate Esters, J. Chromatogr., 1979, 172, 1, 261-271, https://doi.org/10.1016/S0021-9673(00)90961-0 . [all data]

Waggott and Davies, 1984
Waggott, A.; Davies, I.W., Identification of organic pollutants using linear temperature programmed retention indices (LTPRIs) - Part II, 1984, retrieved from http://dwi.defra.gov.uk/research/completed-research/reports/dwi0383.pdf. [all data]