9,10-Phenanthrenedione

Gas phase thermochemistry data

Data compiled by: Hussein Y. Afeefy, Joel F. Liebman, and Stephen E. Stein

Quantity Value Units Method Reference Comment
Δfgas-11.1 ± 0.67kcal/molCcbRibeiro Da Silva, Ribeiro Da Silva, et al., 1989

Condensed phase thermochemistry data

Data compiled by: Hussein Y. Afeefy, Joel F. Liebman, and Stephen E. Stein

Quantity Value Units Method Reference Comment
Δfsolid-36.97 ± 0.57kcal/molCcbRibeiro Da Silva, Ribeiro Da Silva, et al., 1989
Quantity Value Units Method Reference Comment
Δcsolid-1553.01 ± 0.38kcal/molCcbRibeiro Da Silva, Ribeiro Da Silva, et al., 1989Corresponding Δfsolid = -36.962 kcal/mol (simple calculation by NIST; no Washburn corrections)
Δcsolid-1534.695kcal/molCcbMagnus, 1956Corresponding Δfsolid = -55.281 kcal/mol (simple calculation by NIST; no Washburn corrections)
Δcsolid-1544.0kcal/molCcbSwietoslawski and Starczedska, 1925Corresponding Δfsolid = -46.0 kcal/mol (simple calculation by NIST; no Washburn corrections)

Normal alkane RI, non-polar column, temperature ramp

Data compiled by: NIST Mass Spectrometry Data Center, William E. Wallace, director

Column type Capillary
Active phase Ultra-1
Column length (m) 25.
Carrier gas He
Substrate
Column diameter (mm) 0.32
Phase thickness (μm) 0.25
Tstart (C) 80.
Tend (C) 260.
Heat rate (K/min) 3.
Initial hold (min)
Final hold (min)
I 1935.
ReferenceOkumura, 1991
Comment MSDC-RI

References

Ribeiro Da Silva, Ribeiro Da Silva, et al., 1989
Ribeiro Da Silva, M.A.V.; Ribeiro Da Silva, D.M.C.; Teixeira, J.A.S., Enthalpies of combustion of 1,4-naphthoquinone, 9,10-anthraquinone, 9,10-phenanthraquinone, 1,4,9,10-anthradiquinone, 5,8-dihydroxy-1,4-naphthoquinone, and 1,4-dihydroxy-9,10-anthraquinone, J. Chem. Thermodyn., 1989, 21, 265-274. [all data]

Magnus, 1956
Magnus, A., Die resonanzenergien der parachinone Aui grund der prazisionsmessungsen ihrer verbrennungswarmen durch herrn gerhard wittwer, Z. Phys. Chem. (Neue Folge), 1956, 9, 141-161. [all data]

Swietoslawski and Starczedska, 1925
Swietoslawski, W.; Starczedska, H., Correction des donnees thermochimiques de M.A. Valeur, J. Chem. Phys., 1925, 22, 399-401. [all data]