2-Butyl-4,5-dimethyloxazole

Van Den Dool and Kratz RI, non-polar column, temperature ramp

View large format table.

Column type Active phase I Reference Comment
CapillarySPD-11096.Carlin, Jin, et al., 198650. C @ 5. min, 2. K/min, 280. C @ 30. min; Column length: 60. m; Column diameter: 0.25 mm

References

Carlin, Jin, et al., 1986
Carlin, J.T.; Jin, Q.Z.; Huang, T.-C.; Ho, C.-T.; Chang, S.S., Identification of alkyloxazoles, in the volatile compounds from french-fried potatoes, J. Agric. Food Chem., 1986, 34, 4, 621-623, https://doi.org/10.1021/jf00070a008 . [all data]