Di-sec-butyl telluride

Phase change data

Data compiled by: William E. Acree, Jr., James S. Chickos

Enthalpy of vaporization

ΔvapH (kcal/mol) Temperature (K) Reference Comment
11.9 ± 0.2338.Baev, Podkovirov, et al., 1996Based on data from 303. - 372. K.

References

Baev, Podkovirov, et al., 1996
Baev, A.K.; Podkovirov, A.I.; Kosirkin, V.I., Thermodynamic properties and associative interactions of alkyl compounds of tellurium, Izv. Vyssh. Uchebn. Zaved., Khim. Khim. Tekhnol., 1996, 39, 6, 10. [all data]