Farnesene epoxide, E-

Normal alkane RI, non-polar column, temperature ramp

View large format table.

Column type Active phase I Reference Comment
CapillaryHP-5 MS1624.Lazarevic, Radulovic, et al., 201030. m/0.25 mm/0.25 μm, Helium, 5. K/min; Tstart: 70. C; Tend: 290. C

References

Lazarevic, Radulovic, et al., 2010
Lazarevic, J.; Radulovic, N.; Palic, R.; Zlatkovic, B., Chemical Analusis of volatile constituents of Berula erecta (Hudson) Coville subsp. erecta (Apiaceae) from Serbia, J. Essential Oil. Res., 2010, 22, 3, 153-156, https://doi.org/10.1080/10412905.2010.9700290 . [all data]