Tetraarsenic trioxide

Gas phase ion energetics data

Data compiled by: Sharon G. Lias, John E. Bartmess, Joel F. Liebman, John L. Holmes, Rhoda D. Levin, and W. Gary Mallard

Ionization energy determinations

IE (eV) Method Reference
8.8 ± 0.3EIBrittain, Lau, et al., 1982

References

Brittain, Lau, et al., 1982
Brittain, R.D.; Lau, K.H.; Hildenbrand, D.L., Molecular species in the As-O system, J. Phys. Chem., 1982, 86, 5072. [all data]