Methanone, bis(2-hydroxyphenyl)-

Phase change data

Data compiled by: William E. Acree, Jr., James S. Chickos

Enthalpy of fusion

ΔfusH (kcal/mol) Temperature (K) Reference
4.797334.5Tomitaka, Mizukami, et al., 2005

References

Tomitaka, Mizukami, et al., 2005
Tomitaka, S.; Mizukami, M.; Paladi, F.; Oguni, M., Thermal and dielectric studies of 2,2'-dihydroxybenzophenone, J Therm Anal Calorim, 2005, 81, 3, 637-643, https://doi.org/10.1007/s10973-005-0836-x . [all data]