γ-Sitosterol

Normal alkane RI, non-polar column, custom temperature program

Data compiled by: NIST Mass Spectrometry Data Center, William E. Wallace, director

Column type Capillary
Active phase RTX-5 MS
Column length (m) 15.
Carrier gas Helium
Substrate
Column diameter (mm) 0.25
Phase thickness (μm) 0.25
Program 35 0C (6 min) 5 0C/min -> 150 0C 10 0C/min -> 280 0C (3 min)
I 3290.
ReferenceNadaf, Halimi, et al., 2012
Comment MSDC-RI

References

Nadaf, Halimi, et al., 2012
Nadaf, M.; Halimi, M.; Mortazavi, M., Identification of nonpolar chemical composition Spartium junceum flower growing in Iran by GC-MS, Middle-East J. Sci. Res., 2012, 11, 2, 221-224. [all data]