5α-Stigmastan-3β-ol

Normal alkane RI, non-polar column, custom temperature program

Data compiled by: NIST Mass Spectrometry Data Center, William E. Wallace, director

Column type CapillaryCapillary
Active phase DB-5 MSOV-1, SE-30, Methyl silicone, SP-2100, OV-101, DB-1, etc.
Column length (m) 30.50.
Carrier gas HeliumHydrogen
Substrate
Column diameter (mm) 0.250.32
Phase thickness (μm) 0.25
Program not specifiednot specified
I 3317.3290.
ReferenceRadulovic and Dordevic, 2011Waggott and Davies, 1984
Comment MSDC-RI MSDC-RI

Normal alkane RI, non-polar column, temperature ramp

Data compiled by: NIST Mass Spectrometry Data Center, William E. Wallace, director

Column type Capillary
Active phase DB-5 MS
Column length (m) 30.
Carrier gas Helium
Substrate
Column diameter (mm) 0.25
Phase thickness (μm) 0.25
Tstart (C) 70.
Tend (C) 315.
Heat rate (K/min) 5.
Initial hold (min)
Final hold (min) 10.
I 3325.
ReferenceRadulovic and Dordevic, 2011
Comment MSDC-RI

References

Radulovic and Dordevic, 2011
Radulovic, N.S.; Dordevic, N.D., Sterods from poison hemlock (Conium maculatum L.): a GC-MS analysis, J. Serb. Chem. Soc., 2011, 76, 11, 1471-1483, https://doi.org/10.2298/JSC110206128R . [all data]

Waggott and Davies, 1984
Waggott, A.; Davies, I.W., Identification of organic pollutants using linear temperature programmed retention indices (LTPRIs) - Part II, 1984, retrieved from http://dwi.defra.gov.uk/research/completed-research/reports/dwi0383.pdf. [all data]