Ametryn

Phase change data

Data compiled by: William E. Acree, Jr., James S. Chickos

Quantity Value Units Method Reference Comment
Δvap125. ± 6.kJ/molDSCVecchio and Brunetti, 2007
Δvap118. ± 4.kJ/molTGAVecchio and Brunetti, 2007

Enthalpy of vaporization

ΔvapH (kJ/mol) Temperature (K) Method Reference
91. ± 4.466.DSCVecchio and Brunetti, 2007
84.9 ± 1.3453.TGAVecchio and Brunetti, 2007

Enthalpy of sublimation

ΔsubH (kJ/mol) Temperature (K) Method Reference Comment
100.9338.GS-GCStephenson and Malanowski, 1987Based on data from 323. - 403. K. See also Friedrich and Stammbach, 1964.

Enthalpy of fusion

ΔfusH (kJ/mol) Temperature (K) Method Reference
26.0359.1DSCVecchio and Brunetti, 2007

References

Vecchio and Brunetti, 2007
Vecchio, Stefano; Brunetti, Bruno, Vapor Pressures and Standard Molar Sublimation Enthalpies of Three 6-Methylthio-2,4-di(alkylamino)-1,3,5-triazine Derivatives: Simetryn, Ametryn, and Terbutryn, J. Chem. Eng. Data, 2007, 52, 5, 1585-1594, https://doi.org/10.1021/je600580r . [all data]

Stephenson and Malanowski, 1987
Stephenson, Richard M.; Malanowski, Stanislaw, Handbook of the Thermodynamics of Organic Compounds, 1987, https://doi.org/10.1007/978-94-009-3173-2 . [all data]

Friedrich and Stammbach, 1964
Friedrich, K.; Stammbach, K., Gas chromatographic determination of small vapour pressures determination of the vapour pressures of some triazine herbicides, Journal of Chromatography A, 1964, 16, 22-28, https://doi.org/10.1016/S0021-9673(01)82436-5 . [all data]