Benzyl phenyl sulfoxide

Phase change data

Data compiled by: Thermodynamics Research Center, NIST Boulder Laboratories, Chris Muzny director

Quantity Value Units Method Reference Comment
Tfus393.KN/ADyer, Harris, et al., 1982Uncertainty assigned by TRC = 3. K
Tfus396.KN/AVenier, Squires, et al., 1982Uncertainty assigned by TRC = 3. K

In addition to the Thermodynamics Research Center (TRC) data available from this site, much more physical and chemical property data is available from the following TRC products:

References

Dyer, Harris, et al., 1982
Dyer, J.C.; Harris, D.L.; Evans, S.A., Oxygen-17 Nulcear Magnetic RFesonacne SPtroscopy of Sulfoxides and Sulfones. Alkyl Substituent Induced Chemical Shifts, J. Org. Chem., 1982, 47, 3660-4. [all data]

Venier, Squires, et al., 1982
Venier, C.G.; Squires, T.G.; Chen, Y. -Y; Hussmann, G.P.; Shei, J. C>; Smith, G.F., Peroxyfluoroacetic Acid. A Convenient Reagent for the Preparation of Sulfoxides and Sulfones, J. Org. Chem., 1982, 47, 3773-4. [all data]