Stilbene, α-methyl-, (E)-

Condensed phase thermochemistry data

Data compiled by: Hussein Y. Afeefy, Joel F. Liebman, and Stephen E. Stein

Quantity Value Units Method Reference Comment
Δcsolid-1939.kcal/molCcbLemoult, 1911Corresponding Δfsolid = 50. kcal/mol (simple calculation by NIST; no Washburn corrections)

Phase change data

Data compiled as indicated in comments:
BS - Robert L. Brown and Stephen E. Stein
TRC - Thermodynamics Research Center, NIST Boulder Laboratories, Chris Muzny director

Quantity Value Units Method Reference Comment
Tboil558.7KN/AAldrich Chemical Company Inc., 1990BS
Quantity Value Units Method Reference Comment
Tfus354.65KN/ARottendorf, Sternhell, et al., 1965Uncertainty assigned by TRC = 2. K; TRC

In addition to the Thermodynamics Research Center (TRC) data available from this site, much more physical and chemical property data is available from the following TRC products:

Reaction thermochemistry data

Data compiled by: Hussein Y. Afeefy, Joel F. Liebman, and Stephen E. Stein

Individual Reactions

α-Methyl-cis-stilbene = Stilbene, α-methyl-, (E)-

By formula: C15H14 = C15H14

Quantity Value Units Method Reference Comment
Δr-0.5 ± 0.2kcal/molCisoFischer, Muszkat, et al., 1968solid phase; solvent: Cyclohexane

Gas phase ion energetics data

Data compiled as indicated in comments:
LLK - Sharon G. Lias, Rhoda D. Levin, and Sherif A. Kafafi

Ionization energy determinations

IE (eV) Method Reference Comment
8.10 ± 0.05PEDistefano, Mazzucato, et al., 1975Vertical value; LLK

References

Lemoult, 1911
Lemoult, M.P., Thermochimie. - Recherches sur les derives du styrolene; rectification de quelques erreurs experimentales, Compt. Rend., 1911, 152, 1402-1404. [all data]

Aldrich Chemical Company Inc., 1990
Aldrich Chemical Company Inc., Catalog Handbook of Fine Chemicals, Aldrich Chemical Company, Inc., Milwaukee WI, 1990, 1. [all data]

Rottendorf, Sternhell, et al., 1965
Rottendorf, H.; Sternhell, S.; Wilmshurst, J.R., Proton Magnetic Resonance Spectra of Some β-Methylstyrenes, β, β-Dimethylstyrenes and α-Methylstilbenes and A Discussion of Long Range Shielding and Coupling Effects in These and, Aust. J. Chem., 1965, 18, 1759. [all data]

Fischer, Muszkat, et al., 1968
Fischer, G.; Muszkat, K.A.; Fischer, E., Thermodynamic equilibrium between cis- and trans-isomers in stilbene and some derivatives, J. Chem. Soc. B, 1968, 1156-1158. [all data]

Distefano, Mazzucato, et al., 1975
Distefano, G.; Mazzucato, U.; Modelli, A.; Pignataro, S.; Orlandi, G., Photoelectron (He I) spectroscopic study of styrylpyridines, J. Chem. Soc. Faraday Trans. 2, 1975, 71, 1583. [all data]