3,3'-Di(N-cyclopropylmethyl)-4,5-epoxy-14-hydroxymorphinan-6-one-3-yl)carbonate

Phase change data

Data compiled by: William E. Acree, Jr., James S. Chickos

Enthalpy of fusion

ΔfusH (kJ/mol) Temperature (K) Method Reference
17.5490.6DSCHammell, Hamad, et al., 2004

References

Hammell, Hamad, et al., 2004
Hammell, Dana C.; Hamad, Mohamed; Vaddi, Haranath K.; Crooks, Peter A.; Stinchcomb, Audra L., A duplex "Gemini" prodrug of naltrexone for transdermal delivery, Journal of Controlled Release, 2004, 97, 2, 283-290, https://doi.org/10.1016/j.jconrel.2004.03.020 . [all data]