1-Naphthalenol, acetate

Condensed phase thermochemistry data

Data compiled by: Hussein Y. Afeefy, Joel F. Liebman, and Stephen E. Stein

Quantity Value Units Method Reference Comment
Δfsolid-72.89 ± 0.27kcal/molCcbColomina, Roux, et al., 1975
Quantity Value Units Method Reference Comment
Δcsolid-1383.9 ± 1.4kcal/molCcbBalcan, Arzik, et al., 1996Corresponding Δfsolid = -86.27 kcal/mol (simple calculation by NIST; no Washburn corrections)
Δcsolid-1397.30 ± 0.27kcal/molCcbColomina, Roux, et al., 1975Corresponding Δfsolid = -72.885 kcal/mol (simple calculation by NIST; no Washburn corrections)
Δcsolid-1401.2 ± 1.8kcal/molCcbLeman and Lepoutre, 1948Corresponding Δfsolid = -68.96 kcal/mol (simple calculation by NIST; no Washburn corrections)

References

Colomina, Roux, et al., 1975
Colomina, M.; Roux, M.V.; Turrion, C., Thermochemical properties of naphthalene compounds III. Enthalpies of combustion and formation of the 1- and 2-naphthylacetic acids and 1- and 2-naphthyl acetates, J. Chem. Thermodyn., 1975, 7, 759-762. [all data]

Balcan, Arzik, et al., 1996
Balcan, M.; Arzik, S.; Altunata, T., The determination of the heats of combustion and the resonance energies of some substituted naphthalenes, Thermochim. Acta, 1996, 278, 49-56. [all data]

Leman and Lepoutre, 1948
Leman, A.; Lepoutre, G., Chaleurs de combustion des naphtols, C. R. Acad. Sci. Paris, 1948, 226, 1976-19. [all data]