Acetic acid, dichloro-, heptyl ester

Kovats' RI, non-polar column, isothermal

Data compiled by: NIST Mass Spectrometry Data Center, William E. Wallace, director

Column type CapillaryCapillaryCapillaryCapillaryCapillary
Active phase SE-30SE-30SE-30SE-30SE-30
Column length (m) 25.25.25.25.25.
Carrier gas N2N2N2N2
Substrate
Column diameter (mm) 0.330.330.330.330.22
Phase thickness (μm)
Temperature (C) 140.160.180.200.100.
I 1372.1376.1374.1372.1364.
ReferenceHaken and Korhonen, 1986Haken and Korhonen, 1986Haken and Korhonen, 1986Haken and Korhonen, 1986Haken, Madden, et al., 1983
Comment MSDC-RI MSDC-RI MSDC-RI MSDC-RI MSDC-RI
Column type CapillaryCapillaryCapillary
Active phase SE-30SE-30OV-101
Column length (m) 25.25.15.
Carrier gas   N2
Substrate
Column diameter (mm) 0.220.220.22
Phase thickness (μm)
Temperature (C) 140.180.200.
I 1380.1399.1385.2
ReferenceHaken, Madden, et al., 1983Haken, Madden, et al., 1983Komárek, Hornová, et al., 1982
Comment MSDC-RI MSDC-RI MSDC-RI

References

Haken and Korhonen, 1986
Haken, J.R.; Korhonen, I.O.O., Gas chromatography of homologous esters. XXXIII. Capillary chromatography of monochlorinated C1-C8 n-alkyl acetates, chloracetates, dichloroacetates and trichloroacetates, J. Chromatogr., 1986, 357, 253-271, https://doi.org/10.1016/S0021-9673(01)95828-5 . [all data]

Haken, Madden, et al., 1983
Haken, J.K.; Madden, B.G.; Korhonen, I.O.O., Gas chromatography of homologous esters. XX. Capillary column studies of alkyl acetates, chloroacetates, dichloroacetates and trichloroacetates, J. Chromatogr., 1983, 256, 221-229, https://doi.org/10.1016/S0021-9673(01)88235-2 . [all data]

Komárek, Hornová, et al., 1982
Komárek, K.; Hornová, L.; Churácek, J., Glass capillary gas chromatography of homologous series of esters. Separation of homologous series of esters of halogenated carboxylic acids on a glass capillary column with the non-polar stationary silicone phase OV-101, J. Chromatogr., 1982, 244, 1, 142-147, https://doi.org/10.1016/S0021-9673(00)80131-4 . [all data]