Naphthalene, 2,3,6-trimethyl-

Kovats' RI, non-polar column, isothermal

View large format table.

Column type Active phase Temperature (C) I Reference Comment
CapillaryOV-1150.1532.Zhang, Chen, et al., 199725. m/0.2 mm/0.33 μm, N2
CapillaryOV-1150.1533.Zhang, Chen, et al., 199725. m/0.2 mm/0.33 μm, N2
CapillaryOV-1160.1542.Zhang, Chen, et al., 199725. m/0.2 mm/0.33 μm, N2
CapillarySE-30130.1515.Bredael, 1982Column length: 100. m; Column diameter: 0.5 mm
CapillarySE-30150.1533.Bredael, 1982Column length: 100. m; Column diameter: 0.5 mm
CapillaryOV-101140.1529.4Gerasimenko, Kirilenko, et al., 1981N2; Column length: 50. m; Column diameter: 0.3 mm
CapillaryOV-101160.1544.1Gerasimenko, Kirilenko, et al., 1981N2; Column length: 50. m; Column diameter: 0.3 mm
CapillaryApiezon L200.1531.Klemm, Shabtai, et al., 1981
CapillaryOV-1130.1522.Engewald, Wennrich, et al., 1979Column length: 50. m; Column diameter: 0.23 mm

Van Den Dool and Kratz RI, non-polar column, temperature ramp

View large format table.

Column type Active phase I Reference Comment
CapillaryPetrocol DH1509.73White, Douglas, et al., 1992100. m/0.25 mm/0.5 μm, He, 1. K/min; Tstart: 30. C; Tend: 220. C
CapillaryPetrocol DH1510.White, Hackett, et al., 1992100. m/0.25 mm/0.5 μm, He, 1. K/min; Tstart: 30. C; Tend: 220. C

Normal alkane RI, non-polar column, isothermal

View large format table.

Column type Active phase Temperature (C) I Reference Comment
CapillaryOV-101120.1529.Nabivach and Gerasimenko, 1996
PackedPolydimethyl siloxane147.1528.Ferrand, 1962

Normal alkane RI, non-polar column, temperature ramp

View large format table.

Column type Active phase I Reference Comment
CapillaryUltra-11530.Elizalde-González, Hutfliess, et al., 199650. m/0.2 mm/0.33 μm, H2, 3. K/min, 300. C @ 35. min; Tstart: 60. C

Normal alkane RI, non-polar column, custom temperature program

View large format table.

Column type Active phase I Reference Comment
CapillaryRTX-5 MS1550.Nadaf, Halimi, et al., 201215. m/0.25 mm/0.25 μm, Helium; Program: 35 0C (6 min) 5 0C/min -> 150 0C 10 0C/min -> 280 0C (3 min)
CapillaryOV-1, SE-30, Methyl silicone, SP-2100, OV-101, DB-1, etc.1515.Waggott and Davies, 1984Hydrogen; Column length: 50. m; Column diameter: 0.32 mm; Program: not specified

Lee's RI, non-polar column, temperature ramp

View large format table.

Column type Active phase I Reference Comment
CapillaryDB-5MS264.76Sun, Zhou, et al., 200830. m/0.25 mm/0.25 μm, 50. C @ 2. min, 6. K/min, 300. C @ 16. min
CapillaryDB-5MS264.98Chen, Keeran, et al., 200230. m/0.25 mm/0.5 μm, 40. C @ 1. min, 10. K/min; Tend: 310. C
CapillaryPTE-5263.83Wang, Jia, et al., 200030. m/0.25 mm/0.25 μm, 60. C @ 1.5 min, 8. K/min, 300. C @ 12.5 min
CapillaryDB-5265.3Durlak, Biswas, et al., 199830. m/0.25 mm/0.25 μm, 15. K/min; Tstart: 50. C; Tend: 300. C
CapillarySE-52261.83Wang, Peng, et al., 19974. K/min; Column length: 30. m; Column diameter: 0.30 mm; Tstart: 40. C; Tend: 250. C
CapillaryDB-5265.43Williams and Horne, 1995He, 60. C @ 2. min, 5. K/min; Column length: 25. m; Column diameter: 0.3 mm; Tend: 270. C
CapillaryDB-5265.16Wang, Fingas, et al., 199430. m/0.32 mm/0.25 μm, He, 50. C @ 2. min, 6. K/min; Tend: 300. C
CapillaryCP Sil 8 CB265.1Bundt, Herbel, et al., 199150. m/0.25 mm/0.25 μm, He, 4. K/min; Tstart: 80. C; Tend: 300. C
CapillaryDB-5263.20Forster, Alexander, et al., 1989H2, 2. K/min, 300. C @ 10. min; Column length: 60. m; Column diameter: 0.20 mm; Tstart: 70. C
CapillarySE-54264.66Guillén, Blanco, et al., 198920. m/0.22 mm/0.20 μm, He, 4. K/min; Tstart: 50. C; Tend: 300. C
CapillaryDB-5264.99Rostad and Pereira, 198630. m/0.26 mm/0.25 μm, He, 50. C @ 4. min, 6. K/min, 300. C @ 20. min
CapillaryDB-5263.87Tong, Centen, et al., 1985He, 4. K/min; Column length: 30. m; Column diameter: 0.25 mm; Tstart: 90. C; Tend: 325. C
CapillaryDB-5263.252Tong, Shore, et al., 1984He, 80. C @ 1. min, 3. K/min, 300. C @ 10. min; Column length: 30. m; Column diameter: 0.32 mm
CapillarySE-52265.09Vassilaros, Kong, et al., 198220. m/0.30 mm/0.25 μm, H2, 40. C @ 2. min, 4. K/min; Tend: 265. C
CapillarySE-52263.31Lee, Vassilaros, et al., 197912. m/0.3 mm/0.34 μm, He, 2. K/min; Tstart: 50. C; Tend: 250. C

Lee's RI, non-polar column, custom temperature program

View large format table.

Column type Active phase I Reference Comment
CapillaryPolydimethyl siloxanes264.99Eckel and Kind, 2003Program: not specified
CapillarySE-52263.31Wang, Peng, et al., 1997Column length: 30. m; Column diameter: 0.30 mm; Program: not specified
CapillaryDB-5264.6Paschke, Herbel, et al., 199230. m/0.25 mm/0.25 μm, He; Program: 60 0C (3 min) 10 0C/min -> 100 0C (3 min) 5 0C/min -> 300 0C
CapillaryCP Sil 8 CB265.0Bundt, Herbel, et al., 199150. m/0.25 mm/0.25 μm, He; Program: not specified
CapillaryCP Sil 8 CB265.1Bundt, Herbel, et al., 199150. m/0.25 mm/0.25 μm, He; Program: not specified
CapillaryDB-5263.31Tong, Centen, et al., 1985He; Column length: 30. m; Column diameter: 0.25 mm; Program: not specified

Phase change data

Data compiled as indicated in comments:
BS - Robert L. Brown and Stephen E. Stein
TRC - Thermodynamics Research Center, NIST Boulder Laboratories, Chris Muzny director

Quantity Value Units Method Reference Comment
Tboil536.7KN/AWeast and Grasselli, 1989BS
Tboil537.KN/ACollie, 1893Uncertainty assigned by TRC = 5. K; TRC
Quantity Value Units Method Reference Comment
Tfus370.KN/ALuther and Riechel, 1950Uncertainty assigned by TRC = 0.6 K; TRC

Reduced pressure boiling point

Tboil (K) Pressure (atm) Reference Comment
420.20.018Weast and Grasselli, 1989BS

In addition to the Thermodynamics Research Center (TRC) data available from this site, much more physical and chemical property data is available from the following TRC products:

References

Zhang, Chen, et al., 1997
Zhang, M.; Chen, B.; Shen, S.; Chen, S., Compositional studies of high-temperature coal tar by g.c.-FT-i.r. analysis of middle oil fractions, Fuel, 1997, 76, 5, 415-423, https://doi.org/10.1016/S0016-2361(97)85518-4 . [all data]

Bredael, 1982
Bredael, P., Retention indices of hydrocarbons on SE-30, J. Hi. Res. Chromatogr. Chromatogr. Comm., 1982, 5, 6, 325-328, https://doi.org/10.1002/jhrc.1240050610 . [all data]

Gerasimenko, Kirilenko, et al., 1981
Gerasimenko, V.A.; Kirilenko, A.V.; Nabivach, V.M., Capillary gas chromatography of aromatic compounds found in coal tar fractions, J. Chromatogr., 1981, 208, 1, 9-16, https://doi.org/10.1016/S0021-9673(00)87953-4 . [all data]

Klemm, Shabtai, et al., 1981
Klemm, L.H.; Shabtai, J.; Bodily, K.C., Gas chromatography of some C13-C16 alkylnaphthalenes on Bentone 34, silicone fluid DC 550 and Apiezon L phases, J. Chromatogr., 1981, 206, 2, 372-375, https://doi.org/10.1016/S0021-9673(00)82549-2 . [all data]

Engewald, Wennrich, et al., 1979
Engewald, W.; Wennrich, L.; Ritter, E., Molekülstruktur und Retentionsverhalten. XII. Zur Retention von Alkylnaphthalinen Bei der Gasverteilungs- und Gas-Adsorptions-Chromatographie, J. Chromatogr., 1979, 174, 2, 315-323, https://doi.org/10.1016/S0021-9673(00)86005-7 . [all data]

White, Douglas, et al., 1992
White, C.M.; Douglas, L.J.; Hackett, J.P.; Anderson, R.R., Characterization of synthetic gasoline from the chloromethane-zeolite reaction, Energy Fuels, 1992, 6, 1, 76-82, https://doi.org/10.1021/ef00031a012 . [all data]

White, Hackett, et al., 1992
White, C.M.; Hackett, J.; Anderson, R.R.; Kail, S.; Spock, P.S., Linear temperature programmed retention indices of gasoline range hydrocarbons and chlorinated hydrocarbons on cross-linked polydimethylsiloxane, J. Hi. Res. Chromatogr., 1992, 15, 2, 105-120, https://doi.org/10.1002/jhrc.1240150211 . [all data]

Nabivach and Gerasimenko, 1996
Nabivach, V.M.; Gerasimenko, V.A., Gas chromatographic retention characteristics of bicyclic aromatic hydrocarbons, Coke and Chemistry (Rus), 1996, 6, 27-31. [all data]

Ferrand, 1962
Ferrand, R., Gas phase chromatography using retention indices for the analysis of tars and their hydrogenation products, Journees internationales d'etude des methodes de separation immediate at de chromatographie; Org. sur l'initiative du IX., 1962, 132-140. [all data]

Elizalde-González, Hutfliess, et al., 1996
Elizalde-González, M.P.; Hutfliess, M.; Hedden, K., Retention index system, adsorption characteristics, and sructure correlations of polycyclic aromatic hydrocarbons in fuels, J. Hi. Res. Chromatogr., 1996, 19, 6, 345-352, https://doi.org/10.1002/jhrc.1240190608 . [all data]

Nadaf, Halimi, et al., 2012
Nadaf, M.; Halimi, M.; Mortazavi, M., Identification of nonpolar chemical composition Spartium junceum flower growing in Iran by GC-MS, Middle-East J. Sci. Res., 2012, 11, 2, 221-224. [all data]

Waggott and Davies, 1984
Waggott, A.; Davies, I.W., Identification of organic pollutants using linear temperature programmed retention indices (LTPRIs) - Part II, 1984, retrieved from http://dwi.defra.gov.uk/research/completed-research/reports/dwi0383.pdf. [all data]

Sun, Zhou, et al., 2008
Sun, P.; Zhou, Q.; Li, G.; Wang, X.; Zhao, Y.; Cao, L., fingerprint analysis of polycyclic aromatic hydrocarbons in crude oil by internal standard method, J. Instrumental Anal., 2008, 27, 4, 344-348. [all data]

Chen, Keeran, et al., 2002
Chen, P.H.; Keeran, W.S.; Van Ausdale, W.A.; Schindler, D.R.; Roberts, D.W., Application of Lee retention indices to the confirmation of tentatively identified compounds from GC/MS analysis of environmental samples, Technical paper, Analytical Services Division, Environmental ScienceEngineering, Inc, PO Box 1703, Gainesville, FL 32602, 2002, 11. [all data]

Wang, Jia, et al., 2000
Wang, J.; Jia, C.R.; Wong, C.K.; Wong, P.K., Characterization of polycyclic aromatic hydrocarbons created in lubricating oils, Water Air Soil Poll., 2000, 120, 3/4, 381-396, https://doi.org/10.1023/A:1005251618062 . [all data]

Durlak, Biswas, et al., 1998
Durlak, S.K.; Biswas, P.; Shi, J.; Bernhard, M.J., Characterization of polycyclic aromatic hydrocarbon particulate and gaseous emissions from polystyrene combustion, Environ. Sci. Technol., 1998, 32, 15, 2301-2307, https://doi.org/10.1021/es9709031 . [all data]

Wang, Peng, et al., 1997
Wang, Y.; Peng, P.; Cui, S.; Zhang, Y., Identification of PAH in the Suzhou River bed sediments by GC/MS and PAH retention index system, J. Nanjing Norm. Univ. (Nat. Sci.), 1997, 20, 2, 47-68. [all data]

Williams and Horne, 1995
Williams, P.T.; Horne, P.A., Analysis of aromatic hydrocarbons in pyrolytic oil derived from biomass, J. Anal. Appl. Pyrolysis, 1995, 31, 15-37, https://doi.org/10.1016/0165-2370(94)00814-H . [all data]

Wang, Fingas, et al., 1994
Wang, Z.; Fingas, M.; Li, K., Fractionation of a light crude oil and identification and quantitation of aliphatic, aromatic, and biomarker comopunds by GC-FID and GC-MS, Part II, J. Chromatogr. Sci., 1994, 32, 9, 367-382, https://doi.org/10.1093/chromsci/32.9.367 . [all data]

Bundt, Herbel, et al., 1991
Bundt, J.; Herbel, W.; Steinhart, H.; Franke, S.; Francke, W., Structure-type separation of diesel fuels by solid phase extraction and identification of the two- and three-ring aromatics by capillary GC-mass spectrometry, J. Hi. Res. Chromatogr., 1991, 14, 2, 91-98, https://doi.org/10.1002/jhrc.1240140205 . [all data]

Forster, Alexander, et al., 1989
Forster, P.G.; Alexander, R.; Kagi, R.I., Identification and analysis of tetramethylnaphthalenes in petroleum, J. Chromatogr., 1989, 483, 384-389, https://doi.org/10.1016/S0021-9673(01)93138-3 . [all data]

Guillén, Blanco, et al., 1989
Guillén, M.D.; Blanco, J.; Bermejo, J.; Blanco, C.G., Temperature programmed retention indices of some PAHs on Capillary columns coated with OV-1701 and SE-54, J. Hi. Res. Chromatogr., 1989, 12, 8, 552-554, https://doi.org/10.1002/jhrc.1240120816 . [all data]

Rostad and Pereira, 1986
Rostad, C.E.; Pereira, W.E., Kovats and Lee retention indices determined by gas chromatography/mass spectrometry for organic compounds of environmental interest, J. Hi. Res. Chromatogr. Chromatogr. Comm., 1986, 9, 6, 328-334, https://doi.org/10.1002/jhrc.1240090603 . [all data]

Tong, Centen, et al., 1985
Tong, H.Y.; Centen, J.D.; Karasek, F.W.; Jellum, E.; Helland, P., Identification of Trace Organic Compounds in Dimethyl Sulphoxide Solution Using High-Performance Liquid Chromatography and Gas Chromatography-Mass Spectrometry, J. Chromatogr., 1985, 324, 373-383, https://doi.org/10.1016/S0021-9673(01)81336-4 . [all data]

Tong, Shore, et al., 1984
Tong, H.Y.; Shore, D.L.; Karasek, F.W.; Helland, P.; Jellum, E., Identification of organic compounds obtained from incineration of municipal waste by high-performance liquid chromatographic fractionation and gas chromatography-mass spectrometry, J. Chromatogr., 1984, 285, 423-441, https://doi.org/10.1016/S0021-9673(01)87784-0 . [all data]

Vassilaros, Kong, et al., 1982
Vassilaros, D.L.; Kong, R.C.; Later, D.W.; Lee, M.L., Linear retention index system for polycyclic aromatic compounds. Critical evaluation and additional indices, J. Chromatogr., 1982, 252, 1-20, https://doi.org/10.1016/S0021-9673(01)88394-1 . [all data]

Lee, Vassilaros, et al., 1979
Lee, M.L.; Vassilaros, D.L.; White, C.M.; Novotny, M., Retention Indices for Programmed-Temperature Capillary-Column Gas Chromatography of Polycyclic Aromatic Hydrocarbons, Anal. Chem., 1979, 51, 6, 768-773, https://doi.org/10.1021/ac50042a043 . [all data]

Eckel and Kind, 2003
Eckel, W.P.; Kind, T., Use of boiling point-Lee retention index correlation for rapid review of gas chromatography-mass spectrometry data, Anal. Chim. Acta., 2003, 494, 1-2, 235-243, https://doi.org/10.1016/j.aca.2003.08.003 . [all data]

Paschke, Herbel, et al., 1992
Paschke, A.; Herbel, W.; Steinhart, H.; Franke, S.; Francke, W., Determination of mono- to tetracyclic aromatic hydrocarbons in lubricating oil, J. Hi. Res. Chromatogr., 1992, 15, 12, 827-833, https://doi.org/10.1002/jhrc.1240151211 . [all data]