Phenindamine

Kovats' RI, non-polar column, isothermal

View large format table.

Column type Active phase Temperature (C) I Reference Comment
PackedSE-30220.2158.Musumarra, Scarlata, et al., 1987N2, 1% se-30 on Anachrom ABS(80-100mesh); Column length: 2. m

Kovats' RI, non-polar column, temperature ramp

View large format table.

Column type Active phase I Reference Comment
CapillaryMethyl Silicone2180.Maurer and Pfleger, 198812. m/0.20 mm/0.33 μm, He, 100. C @ 3. min, 30. K/min, 310. C @ 5. min
CapillarySE-302147.Schepers, Wijsbeek, et al., 198225. m/0.49 mm/1.14 μm, 100. C @ 2. min, 8. K/min, 275. C @ 15. min

Van Den Dool and Kratz RI, non-polar column, temperature ramp

View large format table.

Column type Active phase I Reference Comment
CapillarySE-302109.Anderson and Stafford, 198315. m/0.25 mm/0.25 μm, He, 5. K/min; Tstart: 100. C; Tend: 295. C

Normal alkane RI, non-polar column, custom temperature program

View large format table.

Column type Active phase I Reference Comment
OtherMethyl Silicone2167.Ardrey and Moffat, 1981Program: not specified

References

Musumarra, Scarlata, et al., 1987
Musumarra, G.; Scarlata, G.; Romano, G.; Cappello, G.; Clementi, S.; Giulietti, G., Qualitative organic analysis. Part 2. Identification of drugs by principal components analysis of standardized TLC data in four eluent systems and of retention indices on SE 30, J. Anal. Toxicol., 1987, 11, 4, 154-163, https://doi.org/10.1093/jat/11.4.154 . [all data]

Maurer and Pfleger, 1988
Maurer, H.; Pfleger, K., Identification and Differentiation of Alkylamine Antihistamines and Their Metabolites in Urine by Computerized Gas Chromatography-Mass Spectrometry, J. Chromatogr., 1988, 430, 31-41, https://doi.org/10.1016/S0378-4347(00)83131-X . [all data]

Schepers, Wijsbeek, et al., 1982
Schepers, P.; Wijsbeek, J.; Franke, J.P.; de Zeeuw, R.A., Applicability of capillary gas chromatography to substance identification in toxicology by means of retention indices, J. Forensic Sci., 1982, 27, 1, 49-60. [all data]

Anderson and Stafford, 1983
Anderson, W.H.; Stafford, D.T., Applications of capillary gas chromatography in routine toxicological analyses, J. Hi. Res. Chromatogr. Chromatogr. Comm., 1983, 6, 5, 247-254, https://doi.org/10.1002/jhrc.1240060506 . [all data]

Ardrey and Moffat, 1981
Ardrey, R.E.; Moffat, A.C., Gas-liquid chromatographic retention indices of 1318 substances of toxicological interest on SE-30 or OV-1 stationary phase, J. Chromatogr., 1981, 220, 3, 195-252, https://doi.org/10.1016/S0021-9673(00)81925-1 . [all data]