1,2-Acenaphthylenedione

Phase change data

Data compiled by: Thermodynamics Research Center, NIST Boulder Laboratories, Chris Muzny director

Quantity Value Units Method Reference Comment
Tfus533.65KN/AMoriconi, O'Connor, et al., 1959Uncertainty assigned by TRC = 2. K
Tfus525.15KN/APitt and Smyth, 1959Uncertainty assigned by TRC = 4. K

In addition to the Thermodynamics Research Center (TRC) data available from this site, much more physical and chemical property data is available from the following TRC products:

References

Moriconi, O'Connor, et al., 1959
Moriconi, E.J.; O'Connor, W.F.; Kuhn, L.P.; Keneally, E.A.; Wallenberger, F.T., Intramolecular Gydrogen Bonding of vic-Diols in Cyclic Systems II. OH-O and OH-π-Electron Bonding in cus- and trans-1,2-Diaryl-1,2-acenaphthenediols, J. Am. Chem. Soc., 1959, 81, 6472. [all data]

Pitt and Smyth, 1959
Pitt, D.A.; Smyth, C.P., Microwave Absorption and Molecular Structure in Liquids XXVII. The Mutual Viscosities and Dielectric Relaxtion Times of Several Polar Aromatic Compounds in Solution, J. Am. Chem. Soc., 1959, 81, 783. [all data]