Tricyclo[5.3.0.0(2.6)]deca-1(7)-ene

Reaction thermochemistry data

Data compiled by: Hussein Y. Afeefy, Joel F. Liebman, and Stephen E. Stein

Individual Reactions

Hydrogen + Tricyclo[5.3.0.0(2.6)]deca-1(7)-ene = Cyclobutadicyclopentene, decahydro

By formula: H2 + C10H14 = C10H16

Quantity Value Units Method Reference Comment
Δr-157. ± 1.kJ/molChydRoth, Adamczak, et al., 1991liquid phase

References

Roth, Adamczak, et al., 1991
Roth, W.R.; Adamczak, O.; Breuckmann, R.; Lennartz, H.-W.; Boese, R., Die Berechnung von Resonanzenergien; das MM2ERW-Kraftfeld, Chem. Ber., 1991, 124, 2499-2521. [all data]