Benzene, 1,2-dibromo-3,4,5,6-tetrafluoro-

Phase change data

Data compiled by: Robert L. Brown and Stephen E. Stein

Quantity Value Units Method Reference Comment
Tboil471.2KN/AWeast and Grasselli, 1989

Gas phase ion energetics data

Data compiled by: Sharon G. Lias, Rhoda D. Levin, and Sherif A. Kafafi

Ionization energy determinations

IE (eV) Method Reference
9.50 ± 0.02PEMohraz, Maier, et al., 1980

Van Den Dool and Kratz RI, non-polar column, temperature ramp

View large format table.

Column type Active phase I Reference Comment
CapillaryOV-11100.0Gautzsch and Zinn, 19968. K/min; Tstart: 35. C; Tend: 300. C
CapillaryOV-11100.0Gautzsch and Zinn, 19968. K/min; Tstart: 35. C; Tend: 300. C

References

Weast and Grasselli, 1989
CRC Handbook of Data on Organic Compounds, 2nd Editon, Weast,R.C and Grasselli, J.G., ed(s)., CRC Press, Inc., Boca Raton, FL, 1989, 1. [all data]

Mohraz, Maier, et al., 1980
Mohraz, M.; Maier, J.P.; Heilbronner, E., He(I α) and He(Iα) photoelectron spectra of fluorinated chloro- and bromobenzenes, J. Electron Spectrosc. Relat. Phenom., 1980, 19, 429. [all data]

Gautzsch and Zinn, 1996
Gautzsch, R.; Zinn, P., Use of incremental models to estimate the retention indexes of aromatic compounds, Chromatographia, 1996, 43, 3/4, 163-176, https://doi.org/10.1007/BF02292946 . [all data]