8-Quinolinol, 2-methyl-

Gas phase thermochemistry data

Data compiled by: Hussein Y. Afeefy, Joel F. Liebman, and Stephen E. Stein

Quantity Value Units Method Reference Comment
Δfgas-39.4 ± 2.2kJ/molCcbRibeiro Da Silva, Monte, et al., 1989

Condensed phase thermochemistry data

Data compiled by: Hussein Y. Afeefy, Joel F. Liebman, and Stephen E. Stein

Quantity Value Units Method Reference Comment
Δfsolid-129.8 ± 2.1kJ/molCcbRibeiro Da Silva, Monte, et al., 1989
Quantity Value Units Method Reference Comment
Δcsolid-5091.5 ± 1.6kJ/molCcbRibeiro Da Silva, Monte, et al., 1989

References

Ribeiro Da Silva, Monte, et al., 1989
Ribeiro Da Silva, M.A.V.; Monte, M.J.S.; Matos, M.A.R., Enthalpies of combustion, vapour pressures, and enthalpies of sublimation of 8-hydroxyquinoline, 5-nitro-8-hydroxyquinoline, and 2-methyl-8-hydroxyquinoline, J. Chem. Thermodyn., 1989, 21, 159-166. [all data]