Carbon

Reaction thermochemistry data

Data compiled by: Hussein Y. Afeefy, Joel F. Liebman, and Stephen E. Stein

Individual Reactions

Ethene, tetrafluoro- + 4sodium = 4sodium fluoride + 2Carbon

By formula: C2F4 + 4Na = 4FNa + 2C

Quantity Value Units Method Reference Comment
Δr-385.0 ± 1.1kcal/molCmKolesov, Zenkov, et al., 1962gas phase

References

Kolesov, Zenkov, et al., 1962
Kolesov, V.P.; Zenkov, I.D.; Skuratov, S.M., The standard enthalpy of formation of tetrafluoroethylene, Russ. J. Phys. Chem. (Engl. Transl.), 1962, 36, 45-47. [all data]