2,2-Propanediol, 1,3-dichloro-

Reaction thermochemistry data

Data compiled by: Hussein Y. Afeefy, Joel F. Liebman, and Stephen E. Stein

Individual Reactions

2-Propanone, 1,3-dichloro- + Water = 2,2-Propanediol, 1,3-dichloro-

By formula: C3H4Cl2O + H2O = C3H6Cl2O2

Quantity Value Units Method Reference Comment
Δr6.8 ± 0.1kcal/molEqkBell and Sorensen, 1972liquid phase; solvent: Dioxane; UV

References

Bell and Sorensen, 1972
Bell, R.P.; Sorensen, P.E., Thermodynamic and activation parameters in the reversible hydration of 1,3-dichloroacetone in dioxane, J. Chem. Soc. Perkin Trans. 2, 1972, 1740-1743. [all data]