Thiophene, 2-phenyl-

Van Den Dool and Kratz RI, non-polar column, temperature ramp

Data compiled by: NIST Mass Spectrometry Data Center, William E. Wallace, director

Column type CapillaryCapillaryCapillary
Active phase DB-1DB-1DB-1
Column length (m) 20.20.60.
Carrier gas   He
Substrate
Column diameter (mm) 0.180.180.32
Phase thickness (μm) 0.180.181.
Tstart (C) 60.60.40.
Tend (C) 220.220.220.
Heat rate (K/min) 8.8.2.
Initial hold (min) 3.3.5.
Final hold (min) 5.5.
I 1370.1376.1387.
ReferenceRochat S., de Saint Laumer J.Y., et al., 2007Rochat S., de Saint Laumer J.Y., et al., 2007Kim, 2001
Comment MSDC-RI MSDC-RI MSDC-RI

References

Rochat S., de Saint Laumer J.Y., et al., 2007
Rochat S.; de Saint Laumer J.Y.; Chaintreau A., Analysis of sulfur compounds from the in-oven roast beef aroma by comprehensive two-dimensional gas chromatography, J. Chromatogr. A, 2007, 1147, 1, 85-94, https://doi.org/10.1016/j.chroma.2007.02.039 . [all data]

Kim, 2001
Kim, J.S., Einfluss der Temperatur beim Rösten von Sesam auf Aroma und antioxidative Eigenschaften des Öls, PhD Thesis, Technischen Universität Berlin zur Erlangung des akademischen Grades, Berlin, 2001, 151. [all data]