trans-Di-tert-butylhyponitrite

Gas phase thermochemistry data

Data compiled by: Hussein Y. Afeefy, Joel F. Liebman, and Stephen E. Stein

Quantity Value Units Method Reference Comment
Δfgas-45.1 ± 2.9kcal/molCcbChen and Mendenhall, 1984Author's hf298_condensed=-59.0 kcal/mol

Condensed phase thermochemistry data

Data compiled by: Hussein Y. Afeefy, Joel F. Liebman, and Stephen E. Stein

Quantity Value Units Method Reference Comment
Δfsolid-62.8 ± 2.9kcal/molCcbChen and Mendenhall, 1984Author's hf298_condensed=-59.0 kcal/mol
Quantity Value Units Method Reference Comment
Δcsolid-1304.5 ± 1.8kcal/molCcbChen and Mendenhall, 1984Author's hf298_condensed=-59.0 kcal/mol

Phase change data

Data compiled by: Hussein Y. Afeefy, Joel F. Liebman, and Stephen E. Stein

Quantity Value Units Method Reference Comment
Δsub17.7 ± 0.3kcal/molVChen and Mendenhall, 1984Author's hf298_condensed=-59.0 kcal/mol

References

Chen and Mendenhall, 1984
Chen, H.T.E.; Mendenhall, G.D., Thermochemistry of trans-Di-tert-butyl hyponitrite, J. Am. Chem. Soc., 1984, 106, 6375-6378. [all data]