Benzene, 1-cyclopenten-1-yl-

Gas phase ion energetics data

Data compiled by: Sharon G. Lias, Rhoda D. Levin, and Sherif A. Kafafi

Ionization energy determinations

IE (eV) Method Reference Comment
8.15PEBruckmann and Klessinger, 1974Vertical value

References

Bruckmann and Klessinger, 1974
Bruckmann, P.; Klessinger, M., Photoelektronenspektren organischer verbindungen. V. Wechselwirkung kleiner ringe mit π-systemen, Chem. Ber., 1974, 107, 1108. [all data]