Iridium, tetracarbonylbis[μ-(3,5-dimethyl-1H-pyrazolato-N1,N2)]di-

Gas phase ion energetics data

Data compiled by: Sharon G. Lias and Joel F. Liebman

Ionization energy determinations

IE (eV) Method Reference
7.49 ± 0.03PELichtenberger, Copenhaver, et al., 1988

References

Lichtenberger, Copenhaver, et al., 1988
Lichtenberger, D.L.; Copenhaver, A.S.; Gray, H.B.; Marshall, J.L.; Hopkins, M.D., Valence electronic structure of bis(Pyrazolyl)-bridged iridium dicarbonyl dimers. Electronic effects of 3,5-dimethylpyraxzolyl substitution on metal-metal interactions, Inorg. Chem., 1988, 27, 4488. [all data]