1,3-Dimethy1-5,6-pentamethyleneuracil

Phase change data

Data compiled by: William E. Acree, Jr., James S. Chickos

Enthalpy of sublimation

ΔsubH (kJ/mol) Temperature (K) Method Reference Comment
111.9 ± 0.2346.MEColomina, Jimenez, et al., 1983Based on data from 335. - 358. K.
109. ± 5.330.QRTeplitsky, Yanson, et al., 1980Based on data from 323. - 338. K. See also Colomina, Jimenez, et al., 1983.
113.4 ± 1.3355.MSTeplitsky, Yanson, et al., 1980Based on data from 340. - 370. K. See also Colomina, Jimenez, et al., 1983.

References

Colomina, Jimenez, et al., 1983
Colomina, Manuel; Jimenez, Pilar; Turrion, Concepcion; Kaminski, Miron; Zielenkiewicz, Wojciech, Vapour pressures and enthalpies of sublimation of 1,3-dimethyl-5-ethyluracil and 1,3-dimethyl-5,6-pentamethyleneuracil, Thermochimica Acta, 1983, 68, 2-3, 371-374, https://doi.org/10.1016/0040-6031(83)80239-1 . [all data]

Teplitsky, Yanson, et al., 1980
Teplitsky, A.B.; Yanson, I.K.; Glukhova, O.T.; Zielenkiwicz, A.; Zielenkiewicz, W.; Wierzchowski, K.L., Thermochemistry of aqueous solutions of alkylated nucleic acid bases, Biophysical Chemistry, 1980, 11, 1, 17-21, https://doi.org/10.1016/0301-4622(80)85003-4 . [all data]