2,5-Furandicarboxaldehyde

Normal alkane RI, polar column, custom temperature program

Data compiled by: NIST Mass Spectrometry Data Center, William E. Wallace, director

Column type CapillaryCapillaryCapillary
Active phase DB-WaxStabilwaxDB-Wax
Column length (m) 30.30.30.
Carrier gas HeliumHeliumHe
Substrate
Column diameter (mm) 0.250.250.25
Phase thickness (μm) 0.250.250.25
Program not specified35 0C 3 0C/min -> 100 0C 5 0C/min -> 240 0C (10 min)50 0C (2 min) 6 0C/min -> 150 0C 8 0C/min -> 230 0C (15 min)
I 2006.1996.1969.
ReferenceWelke, Manfroi, et al., 2012Chinnici, Guerrero, et al., 2009Tian, Zhang, et al., 2007
Comment MSDC-RI MSDC-RI MSDC-RI

Normal alkane RI, non-polar column, temperature ramp

Data compiled by: NIST Mass Spectrometry Data Center, William E. Wallace, director

Column type Capillary
Active phase DB-5
Column length (m) 25.
Carrier gas Helium
Substrate
Column diameter (mm) 0.20
Phase thickness (μm) 0.33
Tstart (C) 50.
Tend (C) 240.
Heat rate (K/min) 20.
Initial hold (min) 1.
Final hold (min)
I 1076.
ReferenceCais-Sokolinska, Majcher, et al., 2011
Comment MSDC-RI

References

Welke, Manfroi, et al., 2012
Welke, J.E.; Manfroi, V.; Zanus, M.; Lazarotto, M.; Zini, C.A., Characterization of the volatile profile of Brazilian merlot wines through comprehensive two dimensional gas chromatography time-of-flight mass spectrometric detection, J. Chromatogr. A, 2012, 1226, 124-139, https://doi.org/10.1016/j.chroma.2012.01.002 . [all data]

Chinnici, Guerrero, et al., 2009
Chinnici, F.; Guerrero, E.D.; Sonni, F.; Natali, N.; Marin, R.N.; Riponi, C., Gas chromatography - mass spectrometry (GC-MS) characterization of volatile compounds in quality vinegars with protected Europian geographical indication, J. Agric. Food Chem., 2009, 57, 11, 4784-4792, https://doi.org/10.1021/jf804005w . [all data]

Tian, Zhang, et al., 2007
Tian, Y.; Zhang, X.; Huang, T.; Zou, K.; Zhou, J., Research advances on the essential oils from leaves of Eucalyptus, Food Fermentation Ind. (Chinese), 2007, 33, 10, 143-147. [all data]